{"text_format":"3","workbook":"xlsx","n_sheets":8,"sheets":["Instructions","My Dragons","Habitats","Tables","Info","Single Element Breeding","Ancient World","Timers"],"not_rendered":{"images":1,"macros":1,"defined_names":21},"read":"whole","date_system":"1900"}

{"sheet":"Instructions","index":0,"n_rows":64,"n_cols":1,"rows_kept":64}
["Dragon City Helper Spreadsheet"]
[]
["This spreadsheet has been written to assist you in managing your Dragon City. All the cells that shouldn't be edited have been locked and protected. You can unprotect them and edit them if you know what you are doing. Actually, you can unprotect and edit them even if you don't know what you're doing :-D"]
[]
["The main areas you will use are the \"My Dragons\", \"Habitats\" and \"Timers\" tabs. I've provided instructions below so as not to clutter the relevant worksheets. You can drag the tabs into whichever order you prefer. I like to have the \"Timers\" tab at the end for easy access."]
[]
["My Dragons"]
["Enter your dragon information in columns B thru J as follows:"]
["Column B : Enter the dragon as defined in Dragon City. If you are breeding a dragon that could be any of a number of dragons, use \"Unknown\" or any other name that tells you that you can only determine it once in the hatchery."]
["Column C : Enter the name you have given to that dragon. I named mine the same as in B, adding a 2, 3 etc for duplicates. When I have a dragon in storage, I put the hatching time in this cell eg. \"17h\" if it will take 17 hours to hatch. The breeding/hatching time can be obtained from the \"Tables\" tab."]
["Column D : Enter the level of your dragon. I use 0 for dragons in the hatchery, -1 for dragons in the breeding mountain, -2 for dragons in the breeding tree, -3 for dragons in the breeding sanctuary, and -9 for dragon eggs in storage. You can use whatever works for you."]
["Column E : Enter the star ranking of your dragon (G3, S2, B1 etc)."]
["Column F : Select the type of habitat where you have placed your dragon from the dropdown."]
["Columns G - J : When you train your dragon, enter the number of the attack you are replacing in the T-column eg to replace Attack 1 with Trainable Attack 4, enter 1 in the T4 column."]
[]
["When you enter a valid dragon in Column B, Columns K - AM are populated with information from the \"Tables\" tab. This tells you what category, elements and attacks the dragon has."]
["Attacks with white backgrounds are useable, yellow indicates the attack is unavailable until the required level is attained and green indicates trainable attacks."]
[]
["If the background of column B turnes orange, this indicates a duplicate dragon exists in the spreadsheet."]
[]
["Above the Column Headings are a couple of \"Sort\" buttons. Click them to sort by that column. I keep mine sorted by level so my strongest dragons are at the top."]
[]
["Habitats"]
["This spreadsheet lets you know how much space you have available and which habitats you should build next."]
[]
["Enter the number of each type of habitat you have in columns D and E, D being for habitats on an island and E being for habitats in storage."]
[]
["TIP: Do not upgrade habitats. Rather build \"Big\" ones, move the dragons into the new habitat and then sell or store the small habitat. Upgrading costs the same as building but you don't get a refund on the small habitat."]
["TIP: Keep a small and big habitat of each type in storage so if you get caught with an egg hatching and no habitat available, you can quickly use one from storage rather than having to wait for it to be built."]
[]
["Timers"]
["This spreadsheet provides you with a warning when things need to be done in Dragon City. The time turns orange and beeps once with 2 minutes to go, beeps twice with 1 minute to go, and turns red and beeps 3 times when time is up. NOTE: The beeps only occur for the top timer."]
[]
["You can stop and start the timer with the button at the top of the sheet. The timer updates every 5 seconds but sometimes gets stuck so periodically check that the time is changing. If not, stop and start the timer."]
[]
["Enter the days, hours, minutes and, optionally, seconds in column B rows 4 - 7. Then move the active cell to the desired row in column A rows 15 - 52 and click the \"Copy Expiry Time\" button. The time will be copied to the active cell."]
[]
["Enter a description in column B. To help with breeding/hatching planning, start the description for breeding with \"Breeding - \" and hatching with \"Hatchery - \" (see examples in spreadsheet). This will colour the descriptions red(ish) and green so you can see when eggs will be added to the hatchery and removed."]
[]
["After updating expiry times, click the \"Sort Timers\" button to get them in chronological order."]
[]
["You can also edit each individual timer to get an exact time. I do this for the Dragon Market, changing the time from 09:00 to 21:00 and back again to do a 12 hour collection."]
[]
["Tables"]
["This is where the support data is stored, and will need to be updated when new dragons, attacks, habitats etc are added. This spreadsheet is NOT protected so be careful not to make mistakes here."]
[]
["To add a new dragon, go to the first open row in Column J and add the information into columns J - Y."]
[]
["The colour coding for column J is: White = breedable & not owned, Green = owned, Mauve = non-breedable and not owned."]
[]
["Column X indicates breeding status: 0 = non-breedable, 1 = breedable. Yellow indicates breedable at certain sanctuary levels."]
[]
["Above the dragon table are a number of sort buttons. Click them to get the table in the desired order. The \"Sort Habitat\" is useful for finding dragons with specific habitats as required by some quests or for possible breeding results in the Ancient World."]
[]
["Info"]
["Provides information about farming and feeding requirements."]
[]
["Single Element Breeding"]
["This sheet shows you which dragons you have (green) or need to be bred (white). This is based on levels 4 - 9."]
[]
["TIP: Do not feed single element dragons above level 9 unless you really need to for tournaments etc because you often need lower level dragons to breed some hybrids. It also makes for easier breeding of the dragons in the sheet because above 9, additional breeding options are added."]
[]
["Ancient World"]
["This is a work in progress."]

{"sheet":"My Dragons","index":1,"n_rows":710,"n_cols":39,"rows_kept":710,"merged":[[1,29,1,30],[2,15,2,38],[3,11,3,14],[3,15,3,26],[3,27,3,38],[4,15,4,17],[4,18,4,20],[4,21,4,23],[4,24,4,26],[4,27,4,29],[4,30,4,32],[4,33,4,35],[4,36,4,38]]}
["Dragon City - My Dragons",{"$nulls":26},"Legend"]
[{"$nulls":27},"Useable","Trainable","Unavailable"]
[{"$nulls":15},"Combat"]
[{"$nulls":11},"Elements",{"$nulls":3},"Attack",{"$nulls":11},"Trainable"]
["Number","Dragon","Name","Level","Rank","Habitat","T1","T2","T3","T4","Category",1,2,3,4,1,null,null,2,null,null,3,null,null,4,null,null,1,null,null,2,null,null,3,null,null,4]
[1,"Flame","Xili",4,null,"Flame",{"$nulls":4},{"$f":"IF(ISBLANK($B6),0,VLOOKUP($B6,FullDragonTable,2,0))","v":1},{"$f":"IF(ISBLANK($B6),\"\",IF(ISBLANK(VLOOKUP($B6,FullDragonTable,3,0)),\"\",VLOOKUP($B6,FullDragonTable,3,0)))","v":"Flame"},{"$f":"IF(ISBLANK($B6),\"\",IF(ISBLANK(VLOOKUP($B6,FullDragonTable,4,0)),\"\",VLOOKUP($B6,FullDragonTable,4,0)))","v":" "},{"$f":"IF(ISBLANK($B6),\"\",IF(ISBLANK(VLOOKUP($B6,FullDragonTable,5,0)),\"\",VLOOKUP($B6,FullDragonTable,5,0)))","v":""},{"$f":"IF(ISBLANK($B6),\"\",IF(ISBLANK(VLOOKUP($B6,FullDragonTable,6,0)),\"\",VLOOKUP($B6,FullDragonTable,6,0)))","v":""},{"$f":"IF(ISBLANK($B6),\"\",VLOOKUP($B6,FullDragonTable,7,0))","v":"Punch"},{"$f":"IF(ISBLANK($B6),\"\",VLOOKUP(P6,AttackTable,2,0))","v":"Physical"},{"$f":"IF(ISBLANK($B6),\"\",VLOOKUP(P6,AttackTable,3,0))","v":338},{"$f":"IF(ISBLANK($B6),\"\",VLOOKUP($B6,FullDragonTable,8,0))","v":"Lava Balls"},{"$f":"IF(ISBLANK($B6),\"\",VLOOKUP(S6,AttackTable,2,0))","v":"Flame"},{"$f":"IF(ISBLANK($B6),\"\",VLOOKUP(S6,AttackTable,3,0))","v":550},{"$f":"IF(ISBLANK($B6),\"\",VLOOKUP($B6,FullDragonTable,9,0))","v":"Flaming Arrows"},{"$f":"IF(ISBLANK($B6),\"\",VLOOKUP(V6,AttackTable,2,0))","v":"Flame"},{"$f":"IF(ISBLANK($B6),\"\",VLOOKUP(V6,AttackTable,3,0))","v":650},{"$f":"IF(ISBLANK($B6),\"\",VLOOKUP($B6,FullDragonTable,10,0))","v":"Nuclear Hit"},{"$f":"IF(ISBLANK($B6),\"\",VLOOKUP(Y6,AttackTable,2,0))","v":"Flame"},{"$f":"IF(ISBLANK($B6),\"\",VLOOKUP(Y6,AttackTable,3,0))","v":1050},{"$f":"IF(ISBLANK($B6),\"\",VLOOKUP($B6,FullDragonTable,11,0))","v":"Hard Charge"},{"$f":"IF(ISBLANK($B6),\"\",VLOOKUP(AB6,AttackTable,2,0))","v":"Physical"},{"$f":"IF(ISBLANK($B6),\"\",VLOOKUP(AB6,AttackTable,3,0))","v":488},{"$f":"IF(ISBLANK($B6),\"\",VLOOKUP($B6,FullDragonTable,12,0))","v":"Head Butt"},{"$f":"IF(ISBLANK($B6),\"\",VLOOKUP(AE6,AttackTable,2,0))","v":"Physical"},{"$f":"IF(ISBLANK($B6),\"\",VLOOKUP(AE6,AttackTable,3,0))","v":788},{"$f":"IF(ISBLANK($B6),\"\",VLOOKUP($B6,FullDragonTable,13,0))","v":"Flamethrower"},{"$f":"IF(ISBLANK($B6),\"\",VLOOKUP(AH6,AttackTable,2,0))","v":"Flame"},{"$f":"IF(ISBLANK($B6),\"\",VLOOKUP(AH6,AttackTable,3,0))","v":1200},{"$f":"IF(ISBLANK($B6),\"\",VLOOKUP($B6,FullDragonTable,14,0))","v":"Magma Storm"},{"$f":"IF(ISBLANK($B6),\"\",VLOOKUP(AK6,AttackTable,2,0))","v":"Flame"},{"$f":"IF(ISBLANK($B6),\"\",VLOOKUP(AK6,AttackTable,3,0))","v":1350}]
[2,"Terra","Bobo",4,null,"Terra",{"$nulls":4},{"$f":"IF(ISBLANK($B7),0,VLOOKUP($B7,FullDragonTable,2,0))","v":1},"Terra"," ","","","Punch","Physical",338,"Earthquake","Terra",550,"Meteor Shower","Terra",650,"Tumble Weed","Nature",1050,"Hard Charge","Physical",488,"Tumble Weed","Nature",1050,"Judo Kick","Physical",863,"Sand Storm","Terra",1350]
[3,{"$nulls":9},{"$f":"IF(ISBLANK($B8),0,VLOOKUP($B8,FullDragonTable,2,0))","v":0},"","","","","","","","","","","","","","","","","","","","","","","","","","","",""]
[4,{"$nulls":9},{"$f":"IF(ISBLANK($B9),0,VLOOKUP($B9,FullDragonTable,2,0))","v":0},"","","","","","","","","","","","","","","","","","","","","","","","","","","",""]
[5,{"$nulls":9},{"$f":"IF(ISBLANK($B10),0,VLOOKUP($B10,FullDragonTable,2,0))","v":0},"","","","","","","","","","","","","","","","","","","","","","","","","","","",""]
[6,{"$nulls":9},{"$f":"IF(ISBLANK($B11),0,VLOOKUP($B11,FullDragonTable,2,0))","v":0},"","","","","","","","","","","","","","","","","","","","","","","","","","","",""]
[7,{"$nulls":9},{"$f":"IF(ISBLANK($B12),0,VLOOKUP($B12,FullDragonTable,2,0))","v":0},"","","","","","","","","","","","","","","","","","","","","","","","","","","",""]
[8,{"$nulls":9},{"$f":"IF(ISBLANK($B13),0,VLOOKUP($B13,FullDragonTable,2,0))","v":0},"","","","","","","","","","","","","","","","","","","","","","","","","","","",""]
[9,{"$nulls":9},{"$f":"IF(ISBLANK($B14),0,VLOOKUP($B14,FullDragonTable,2,0))","v":0},"","","","","","","","","","","","","","","","","","","","","","","","","","","",""]
[10,{"$nulls":9},{"$f":"IF(ISBLANK($B15),0,VLOOKUP($B15,FullDragonTable,2,0))","v":0},"","","","","","","","","","","","","","","","","","","","","","","","","","","",""]
[11,{"$nulls":9},{"$f":"IF(ISBLANK($B16),0,VLOOKUP($B16,FullDragonTable,2,0))","v":0},"","","","","","","","","","","","","","","","","","","","","","","","","","","",""]
[12,{"$nulls":9},{"$f":"IF(ISBLANK($B17),0,VLOOKUP($B17,FullDragonTable,2,0))","v":0},"","","","","","","","","","","","","","","","","","","","","","","","","","","",""]
[13,{"$nulls":9},{"$f":"IF(ISBLANK($B18),0,VLOOKUP($B18,FullDragonTable,2,0))","v":0},"","","","","","","","","","","","","","","","","","","","","","","","","","","",""]
[14,{"$nulls":9},{"$f":"IF(ISBLANK($B19),0,VLOOKUP($B19,FullDragonTable,2,0))","v":0},"","","","","","","","","","","","","","","","","","","","","","","","","","","",""]
[15,{"$nulls":9},{"$f":"IF(ISBLANK($B20),0,VLOOKUP($B20,FullDragonTable,2,0))","v":0},"","","","","","","","","","","","","","","","","","","","","","","","","","","",""]
[16,{"$nulls":9},{"$f":"IF(ISBLANK($B21),0,VLOOKUP($B21,FullDragonTable,2,0))","v":0},"","","","","","","","","","","","","","","","","","","","","","","","","","","",""]
[17,{"$nulls":9},{"$f":"IF(ISBLANK($B22),0,VLOOKUP($B22,FullDragonTable,2,0))","v":0},"","","","","","","","","","","","","","","","","","","","","","","","","","","",""]
[18,{"$nulls":9},{"$f":"IF(ISBLANK($B23),0,VLOOKUP($B23,FullDragonTable,2,0))","v":0},"","","","","","","","","","","","","","","","","","","","","","","","","","","",""]
[19,{"$nulls":9},{"$f":"IF(ISBLANK($B24),0,VLOOKUP($B24,FullDragonTable,2,0))","v":0},"","","","","","","","","","","","","","","","","","","","","","","","","","","",""]
[20,{"$nulls":9},{"$f":"IF(ISBLANK($B25),0,VLOOKUP($B25,FullDragonTable,2,0))","v":0},"","","","","","","","","","","","","","","","","","","","","","","","","","","",""]
[21,{"$nulls":9},{"$f":"IF(ISBLANK($B26),0,VLOOKUP($B26,FullDragonTable,2,0))","v":0},"","","","","","","","","","","","","","","","","","","","","","","","","","","",""]
[22,{"$nulls":9},{"$f":"IF(ISBLANK($B27),0,VLOOKUP($B27,FullDragonTable,2,0))","v":0},"","","","","","","","","","","","","","","","","","","","","","","","","","","",""]
[23,{"$nulls":9},{"$f":"IF(ISBLANK($B28),0,VLOOKUP($B28,FullDragonTable,2,0))","v":0},"","","","","","","","","","","","","","","","","","","","","","","","","","","",""]
[24,{"$nulls":9},{"$f":"IF(ISBLANK($B29),0,VLOOKUP($B29,FullDragonTable,2,0))","v":0},"","","","","","","","","","","","","","","","","","","","","","","","","","","",""]
[25,{"$nulls":9},{"$f":"IF(ISBLANK($B30),0,VLOOKUP($B30,FullDragonTable,2,0))","v":0},"","","","","","","","","","","","","","","","","","","","","","","","","","","",""]
[26,{"$nulls":9},{"$f":"IF(ISBLANK($B31),0,VLOOKUP($B31,FullDragonTable,2,0))","v":0},"","","","","","","","","","","","","","","","","","","","","","","","","","","",""]
[27,{"$nulls":9},{"$f":"IF(ISBLANK($B32),0,VLOOKUP($B32,FullDragonTable,2,0))","v":0},"","","","","","","","","","","","","","","","","","","","","","","","","","","",""]
[28,{"$nulls":9},{"$f":"IF(ISBLANK($B33),0,VLOOKUP($B33,FullDragonTable,2,0))","v":0},"","","","","","","","","","","","","","","","","","","","","","","","","","","",""]
[29,{"$nulls":9},{"$f":"IF(ISBLANK($B34),0,VLOOKUP($B34,FullDragonTable,2,0))","v":0},"","","","","","","","","","","","","","","","","","","","","","","","","","","",""]
[30,{"$nulls":9},{"$f":"IF(ISBLANK($B35),0,VLOOKUP($B35,FullDragonTable,2,0))","v":0},"","","","","","","","","","","","","","","","","","","","","","","","","","","",""]
[31,{"$nulls":9},{"$f":"IF(ISBLANK($B36),0,VLOOKUP($B36,FullDragonTable,2,0))","v":0},"","","","","","","","","","","","","","","","","","","","","","","","","","","",""]
[32,{"$nulls":9},{"$f":"IF(ISBLANK($B37),0,VLOOKUP($B37,FullDragonTable,2,0))","v":0},"","","","","","","","","","","","","","","","","","","","","","","","","","","",""]
[33,{"$nulls":9},{"$f":"IF(ISBLANK($B38),0,VLOOKUP($B38,FullDragonTable,2,0))","v":0},"","","","","","","","","","","","","","","","","","","","","","","","","","","",""]
[34,{"$nulls":9},{"$f":"IF(ISBLANK($B39),0,VLOOKUP($B39,FullDragonTable,2,0))","v":0},"","","","","","","","","","","","","","","","","","","","","","","","","","","",""]
[35,{"$nulls":9},{"$f":"IF(ISBLANK($B40),0,VLOOKUP($B40,FullDragonTable,2,0))","v":0},"","","","","","","","","","","","","","","","","","","","","","","","","","","",""]
[36,{"$nulls":9},{"$f":"IF(ISBLANK($B41),0,VLOOKUP($B41,FullDragonTable,2,0))","v":0},"","","","","","","","","","","","","","","","","","","","","","","","","","","",""]
[37,{"$nulls":9},{"$f":"IF(ISBLANK($B42),0,VLOOKUP($B42,FullDragonTable,2,0))","v":0},"","","","","","","","","","","","","","","","","","","","","","","","","","","",""]
[38,{"$nulls":9},{"$f":"IF(ISBLANK($B43),0,VLOOKUP($B43,FullDragonTable,2,0))","v":0},"","","","","","","","","","","","","","","","","","","","","","","","","","","",""]
[39,{"$nulls":9},{"$f":"IF(ISBLANK($B44),0,VLOOKUP($B44,FullDragonTable,2,0))","v":0},"","","","","","","","","","","","","","","","","","","","","","","","","","","",""]
[40,{"$nulls":9},{"$f":"IF(ISBLANK($B45),0,VLOOKUP($B45,FullDragonTable,2,0))","v":0},"","","","","","","","","","","","","","","","","","","","","","","","","","","",""]
[41,{"$nulls":9},{"$f":"IF(ISBLANK($B46),0,VLOOKUP($B46,FullDragonTable,2,0))","v":0},"","","","","","","","","","","","","","","","","","","","","","","","","","","",""]
[42,{"$nulls":9},{"$f":"IF(ISBLANK($B47),0,VLOOKUP($B47,FullDragonTable,2,0))","v":0},"","","","","","","","","","","","","","","","","","","","","","","","","","","",""]
[43,{"$nulls":9},{"$f":"IF(ISBLANK($B48),0,VLOOKUP($B48,FullDragonTable,2,0))","v":0},"","","","","","","","","","","","","","","","","","","","","","","","","","","",""]
[44,{"$nulls":9},{"$f":"IF(ISBLANK($B49),0,VLOOKUP($B49,FullDragonTable,2,0))","v":0},"","","","","","","","","","","","","","","","","","","","","","","","","","","",""]
[45,{"$nulls":9},{"$f":"IF(ISBLANK($B50),0,VLOOKUP($B50,FullDragonTable,2,0))","v":0},"","","","","","","","","","","","","","","","","","","","","","","","","","","",""]
[46,{"$nulls":9},{"$f":"IF(ISBLANK($B51),0,VLOOKUP($B51,FullDragonTable,2,0))","v":0},"","","","","","","","","","","","","","","","","","","","","","","","","","","",""]
[47,{"$nulls":9},{"$f":"IF(ISBLANK($B52),0,VLOOKUP($B52,FullDragonTable,2,0))","v":0},"","","","","","","","","","","","","","","","","","","","","","","","","","","",""]
[48,{"$nulls":9},{"$f":"IF(ISBLANK($B53),0,VLOOKUP($B53,FullDragonTable,2,0))","v":0},"","","","","","","","","","","","","","","","","","","","","","","","","","","",""]
[49,{"$nulls":9},{"$f":"IF(ISBLANK($B54),0,VLOOKUP($B54,FullDragonTable,2,0))","v":0},"","","","","","","","","","","","","","","","","","","","","","","","","","","",""]
[50,{"$nulls":9},{"$f":"IF(ISBLANK($B55),0,VLOOKUP($B55,FullDragonTable,2,0))","v":0},"","","","","","","","","","","","","","","","","","","","","","","","","","","",""]
[51,{"$nulls":9},{"$f":"IF(ISBLANK($B56),0,VLOOKUP($B56,FullDragonTable,2,0))","v":0},"","","","","","","","","","","","","","","","","","","","","","","","","","","",""]
[52,{"$nulls":9},{"$f":"IF(ISBLANK($B57),0,VLOOKUP($B57,FullDragonTable,2,0))","v":0},"","","","","","","","","","","","","","","","","","","","","","","","","","","",""]
[53,{"$nulls":9},{"$f":"IF(ISBLANK($B58),0,VLOOKUP($B58,FullDragonTable,2,0))","v":0},"","","","","","","","","","","","","","","","","","","","","","","","","","","",""]
[54,{"$nulls":9},{"$f":"IF(ISBLANK($B59),0,VLOOKUP($B59,FullDragonTable,2,0))","v":0},"","","","","","","","","","","","","","","","","","","","","","","","","","","",""]
[55,{"$nulls":9},{"$f":"IF(ISBLANK($B60),0,VLOOKUP($B60,FullDragonTable,2,0))","v":0},"","","","","","","","","","","","","","","","","","","","","","","","","","","",""]
[56,{"$nulls":9},{"$f":"IF(ISBLANK($B61),0,VLOOKUP($B61,FullDragonTable,2,0))","v":0},"","","","","","","","","","","","","","","","","","","","","","","","","","","",""]
[57,{"$nulls":9},{"$f":"IF(ISBLANK($B62),0,VLOOKUP($B62,FullDragonTable,2,0))","v":0},"","","","","","","","","","","","","","","","","","","","","","","","","","","",""]
[58,{"$nulls":9},{"$f":"IF(ISBLANK($B63),0,VLOOKUP($B63,FullDragonTable,2,0))","v":0},"","","","","","","","","","","","","","","","","","","","","","","","","","","",""]
[59,{"$nulls":9},{"$f":"IF(ISBLANK($B64),0,VLOOKUP($B64,FullDragonTable,2,0))","v":0},"","","","","","","","","","","","","","","","","","","","","","","","","","","",""]
[60,{"$nulls":9},{"$f":"IF(ISBLANK($B65),0,VLOOKUP($B65,FullDragonTable,2,0))","v":0},"","","","","","","","","","","","","","","","","","","","","","","","","","","",""]
[61,{"$nulls":9},{"$f":"IF(ISBLANK($B66),0,VLOOKUP($B66,FullDragonTable,2,0))","v":0},"","","","","","","","","","","","","","","","","","","","","","","","","","","",""]
[62,{"$nulls":9},{"$f":"IF(ISBLANK($B67),0,VLOOKUP($B67,FullDragonTable,2,0))","v":0},"","","","","","","","","","","","","","","","","","","","","","","","","","","",""]
[63,{"$nulls":9},{"$f":"IF(ISBLANK($B68),0,VLOOKUP($B68,FullDragonTable,2,0))","v":0},"","","","","","","","","","","","","","","","","","","","","","","","","","","",""]
[64,{"$nulls":9},{"$f":"IF(ISBLANK($B69),0,VLOOKUP($B69,FullDragonTable,2,0))","v":0},"","","","","","","","","","","","","","","","","","","","","","","","","","","",""]
[65,{"$nulls":9},{"$f":"IF(ISBLANK($B70),0,VLOOKUP($B70,FullDragonTable,2,0))","v":0},{"$f":"IF(ISBLANK($B70),\"\",IF(ISBLANK(VLOOKUP($B70,FullDragonTable,3,0)),\"\",VLOOKUP($B70,FullDragonTable,3,0)))","v":""},{"$f":"IF(ISBLANK($B70),\"\",IF(ISBLANK(VLOOKUP($B70,FullDragonTable,4,0)),\"\",VLOOKUP($B70,FullDragonTable,4,0)))","v":""},{"$f":"IF(ISBLANK($B70),\"\",IF(ISBLANK(VLOOKUP($B70,FullDragonTable,5,0)),\"\",VLOOKUP($B70,FullDragonTable,5,0)))","v":""},{"$f":"IF(ISBLANK($B70),\"\",IF(ISBLANK(VLOOKUP($B70,FullDragonTable,6,0)),\"\",VLOOKUP($B70,FullDragonTable,6,0)))","v":""},{"$f":"IF(ISBLANK($B70),\"\",VLOOKUP($B70,FullDragonTable,7,0))","v":""},{"$f":"IF(ISBLANK($B70),\"\",VLOOKUP(P70,AttackTable,2,0))","v":""},{"$f":"IF(ISBLANK($B70),\"\",VLOOKUP(P70,AttackTable,3,0))","v":""},{"$f":"IF(ISBLANK($B70),\"\",VLOOKUP($B70,FullDragonTable,8,0))","v":""},{"$f":"IF(ISBLANK($B70),\"\",VLOOKUP(S70,AttackTable,2,0))","v":""},{"$f":"IF(ISBLANK($B70),\"\",VLOOKUP(S70,AttackTable,3,0))","v":""},{"$f":"IF(ISBLANK($B70),\"\",VLOOKUP($B70,FullDragonTable,9,0))","v":""},{"$f":"IF(ISBLANK($B70),\"\",VLOOKUP(V70,AttackTable,2,0))","v":""},{"$f":"IF(ISBLANK($B70),\"\",VLOOKUP(V70,AttackTable,3,0))","v":""},{"$f":"IF(ISBLANK($B70),\"\",VLOOKUP($B70,FullDragonTable,10,0))","v":""},{"$f":"IF(ISBLANK($B70),\"\",VLOOKUP(Y70,AttackTable,2,0))","v":""},{"$f":"IF(ISBLANK($B70),\"\",VLOOKUP(Y70,AttackTable,3,0))","v":""},{"$f":"IF(ISBLANK($B70),\"\",VLOOKUP($B70,FullDragonTable,11,0))","v":""},{"$f":"IF(ISBLANK($B70),\"\",VLOOKUP(AB70,AttackTable,2,0))","v":""},{"$f":"IF(ISBLANK($B70),\"\",VLOOKUP(AB70,AttackTable,3,0))","v":""},{"$f":"IF(ISBLANK($B70),\"\",VLOOKUP($B70,FullDragonTable,12,0))","v":""},{"$f":"IF(ISBLANK($B70),\"\",VLOOKUP(AE70,AttackTable,2,0))","v":""},{"$f":"IF(ISBLANK($B70),\"\",VLOOKUP(AE70,AttackTable,3,0))","v":""},{"$f":"IF(ISBLANK($B70),\"\",VLOOKUP($B70,FullDragonTable,13,0))","v":""},{"$f":"IF(ISBLANK($B70),\"\",VLOOKUP(AH70,AttackTable,2,0))","v":""},{"$f":"IF(ISBLANK($B70),\"\",VLOOKUP(AH70,AttackTable,3,0))","v":""},{"$f":"IF(ISBLANK($B70),\"\",VLOOKUP($B70,FullDragonTable,14,0))","v":""},{"$f":"IF(ISBLANK($B70),\"\",VLOOKUP(AK70,AttackTable,2,0))","v":""},{"$f":"IF(ISBLANK($B70),\"\",VLOOKUP(AK70,AttackTable,3,0))","v":""}]
[66,{"$nulls":9},{"$f":"IF(ISBLANK($B71),0,VLOOKUP($B71,FullDragonTable,2,0))","v":0},"","","","","","","","","","","","","","","","","","","","","","","","","","","",""]
[67,{"$nulls":9},{"$f":"IF(ISBLANK($B72),0,VLOOKUP($B72,FullDragonTable,2,0))","v":0},"","","","","","","","","","","","","","","","","","","","","","","","","","","",""]
[68,{"$nulls":9},{"$f":"IF(ISBLANK($B73),0,VLOOKUP($B73,FullDragonTable,2,0))","v":0},"","","","","","","","","","","","","","","","","","","","","","","","","","","",""]
[69,{"$nulls":9},{"$f":"IF(ISBLANK($B74),0,VLOOKUP($B74,FullDragonTable,2,0))","v":0},"","","","","","","","","","","","","","","","","","","","","","","","","","","",""]
[70,{"$nulls":9},{"$f":"IF(ISBLANK($B75),0,VLOOKUP($B75,FullDragonTable,2,0))","v":0},"","","","","","","","","","","","","","","","","","","","","","","","","","","",""]
[71,{"$nulls":9},{"$f":"IF(ISBLANK($B76),0,VLOOKUP($B76,FullDragonTable,2,0))","v":0},"","","","","","","","","","","","","","","","","","","","","","","","","","","",""]
[72,{"$nulls":9},{"$f":"IF(ISBLANK($B77),0,VLOOKUP($B77,FullDragonTable,2,0))","v":0},"","","","","","","","","","","","","","","","","","","","","","","","","","","",""]
[73,{"$nulls":9},{"$f":"IF(ISBLANK($B78),0,VLOOKUP($B78,FullDragonTable,2,0))","v":0},"","","","","","","","","","","","","","","","","","","","","","","","","","","",""]
[74,{"$nulls":9},{"$f":"IF(ISBLANK($B79),0,VLOOKUP($B79,FullDragonTable,2,0))","v":0},"","","","","","","","","","","","","","","","","","","","","","","","","","","",""]
[75,{"$nulls":9},{"$f":"IF(ISBLANK($B80),0,VLOOKUP($B80,FullDragonTable,2,0))","v":0},"","","","","","","","","","","","","","","","","","","","","","","","","","","",""]
[76,{"$nulls":9},{"$f":"IF(ISBLANK($B81),0,VLOOKUP($B81,FullDragonTable,2,0))","v":0},"","","","","","","","","","","","","","","","","","","","","","","","","","","",""]
[77,{"$nulls":9},{"$f":"IF(ISBLANK($B82),0,VLOOKUP($B82,FullDragonTable,2,0))","v":0},"","","","","","","","","","","","","","","","","","","","","","","","","","","",""]
[78,{"$nulls":9},{"$f":"IF(ISBLANK($B83),0,VLOOKUP($B83,FullDragonTable,2,0))","v":0},"","","","","","","","","","","","","","","","","","","","","","","","","","","",""]
[79,{"$nulls":9},{"$f":"IF(ISBLANK($B84),0,VLOOKUP($B84,FullDragonTable,2,0))","v":0},"","","","","","","","","","","","","","","","","","","","","","","","","","","",""]
[80,{"$nulls":9},{"$f":"IF(ISBLANK($B85),0,VLOOKUP($B85,FullDragonTable,2,0))","v":0},"","","","","","","","","","","","","","","","","","","","","","","","","","","",""]
[81,{"$nulls":9},{"$f":"IF(ISBLANK($B86),0,VLOOKUP($B86,FullDragonTable,2,0))","v":0},"","","","","","","","","","","","","","","","","","","","","","","","","","","",""]
[82,{"$nulls":9},{"$f":"IF(ISBLANK($B87),0,VLOOKUP($B87,FullDragonTable,2,0))","v":0},"","","","","","","","","","","","","","","","","","","","","","","","","","","",""]
[83,{"$nulls":9},{"$f":"IF(ISBLANK($B88),0,VLOOKUP($B88,FullDragonTable,2,0))","v":0},"","","","","","","","","","","","","","","","","","","","","","","","","","","",""]
[84,{"$nulls":9},{"$f":"IF(ISBLANK($B89),0,VLOOKUP($B89,FullDragonTable,2,0))","v":0},"","","","","","","","","","","","","","","","","","","","","","","","","","","",""]
[85,{"$nulls":9},{"$f":"IF(ISBLANK($B90),0,VLOOKUP($B90,FullDragonTable,2,0))","v":0},"","","","","","","","","","","","","","","","","","","","","","","","","","","",""]
[86,{"$nulls":9},{"$f":"IF(ISBLANK($B91),0,VLOOKUP($B91,FullDragonTable,2,0))","v":0},"","","","","","","","","","","","","","","","","","","","","","","","","","","",""]
[87,{"$nulls":9},{"$f":"IF(ISBLANK($B92),0,VLOOKUP($B92,FullDragonTable,2,0))","v":0},"","","","","","","","","","","","","","","","","","","","","","","","","","","",""]
[88,{"$nulls":9},{"$f":"IF(ISBLANK($B93),0,VLOOKUP($B93,FullDragonTable,2,0))","v":0},"","","","","","","","","","","","","","","","","","","","","","","","","","","",""]
[89,{"$nulls":9},{"$f":"IF(ISBLANK($B94),0,VLOOKUP($B94,FullDragonTable,2,0))","v":0},"","","","","","","","","","","","","","","","","","","","","","","","","","","",""]
[90,{"$nulls":9},{"$f":"IF(ISBLANK($B95),0,VLOOKUP($B95,FullDragonTable,2,0))","v":0},"","","","","","","","","","","","","","","","","","","","","","","","","","","",""]
[91,{"$nulls":9},{"$f":"IF(ISBLANK($B96),0,VLOOKUP($B96,FullDragonTable,2,0))","v":0},"","","","","","","","","","","","","","","","","","","","","","","","","","","",""]
[92,{"$nulls":9},{"$f":"IF(ISBLANK($B97),0,VLOOKUP($B97,FullDragonTable,2,0))","v":0},"","","","","","","","","","","","","","","","","","","","","","","","","","","",""]
[93,{"$nulls":9},{"$f":"IF(ISBLANK($B98),0,VLOOKUP($B98,FullDragonTable,2,0))","v":0},"","","","","","","","","","","","","","","","","","","","","","","","","","","",""]
[94,{"$nulls":9},{"$f":"IF(ISBLANK($B99),0,VLOOKUP($B99,FullDragonTable,2,0))","v":0},"","","","","","","","","","","","","","","","","","","","","","","","","","","",""]
[95,{"$nulls":9},{"$f":"IF(ISBLANK($B100),0,VLOOKUP($B100,FullDragonTable,2,0))","v":0},"","","","","","","","","","","","","","","","","","","","","","","","","","","",""]
[96,{"$nulls":9},{"$f":"IF(ISBLANK($B101),0,VLOOKUP($B101,FullDragonTable,2,0))","v":0},"","","","","","","","","","","","","","","","","","","","","","","","","","","",""]
[97,{"$nulls":9},{"$f":"IF(ISBLANK($B102),0,VLOOKUP($B102,FullDragonTable,2,0))","v":0},"","","","","","","","","","","","","","","","","","","","","","","","","","","",""]
[98,{"$nulls":9},{"$f":"IF(ISBLANK($B103),0,VLOOKUP($B103,FullDragonTable,2,0))","v":0},"","","","","","","","","","","","","","","","","","","","","","","","","","","",""]
[99,{"$nulls":9},{"$f":"IF(ISBLANK($B104),0,VLOOKUP($B104,FullDragonTable,2,0))","v":0},"","","","","","","","","","","","","","","","","","","","","","","","","","","",""]
[100,{"$nulls":9},{"$f":"IF(ISBLANK($B105),0,VLOOKUP($B105,FullDragonTable,2,0))","v":0},"","","","","","","","","","","","","","","","","","","","","","","","","","","",""]
[101,{"$nulls":9},{"$f":"IF(ISBLANK($B106),0,VLOOKUP($B106,FullDragonTable,2,0))","v":0},"","","","","","","","","","","","","","","","","","","","","","","","","","","",""]
[102,{"$nulls":9},{"$f":"IF(ISBLANK($B107),0,VLOOKUP($B107,FullDragonTable,2,0))","v":0},"","","","","","","","","","","","","","","","","","","","","","","","","","","",""]
[103,{"$nulls":9},{"$f":"IF(ISBLANK($B108),0,VLOOKUP($B108,FullDragonTable,2,0))","v":0},"","","","","","","","","","","","","","","","","","","","","","","","","","","",""]
[104,{"$nulls":9},{"$f":"IF(ISBLANK($B109),0,VLOOKUP($B109,FullDragonTable,2,0))","v":0},"","","","","","","","","","","","","","","","","","","","","","","","","","","",""]
[105,{"$nulls":9},{"$f":"IF(ISBLANK($B110),0,VLOOKUP($B110,FullDragonTable,2,0))","v":0},"","","","","","","","","","","","","","","","","","","","","","","","","","","",""]
[106,{"$nulls":9},{"$f":"IF(ISBLANK($B111),0,VLOOKUP($B111,FullDragonTable,2,0))","v":0},"","","","","","","","","","","","","","","","","","","","","","","","","","","",""]
[107,{"$nulls":9},{"$f":"IF(ISBLANK($B112),0,VLOOKUP($B112,FullDragonTable,2,0))","v":0},"","","","","","","","","","","","","","","","","","","","","","","","","","","",""]
[108,{"$nulls":9},{"$f":"IF(ISBLANK($B113),0,VLOOKUP($B113,FullDragonTable,2,0))","v":0},"","","","","","","","","","","","","","","","","","","","","","","","","","","",""]
[109,{"$nulls":9},{"$f":"IF(ISBLANK($B114),0,VLOOKUP($B114,FullDragonTable,2,0))","v":0},"","","","","","","","","","","","","","","","","","","","","","","","","","","",""]
[110,{"$nulls":9},{"$f":"IF(ISBLANK($B115),0,VLOOKUP($B115,FullDragonTable,2,0))","v":0},"","","","","","","","","","","","","","","","","","","","","","","","","","","",""]
[111,{"$nulls":9},{"$f":"IF(ISBLANK($B116),0,VLOOKUP($B116,FullDragonTable,2,0))","v":0},"","","","","","","","","","","","","","","","","","","","","","","","","","","",""]
[112,{"$nulls":9},{"$f":"IF(ISBLANK($B117),0,VLOOKUP($B117,FullDragonTable,2,0))","v":0},"","","","","","","","","","","","","","","","","","","","","","","","","","","",""]
[113,{"$nulls":9},{"$f":"IF(ISBLANK($B118),0,VLOOKUP($B118,FullDragonTable,2,0))","v":0},"","","","","","","","","","","","","","","","","","","","","","","","","","","",""]
[114,{"$nulls":9},{"$f":"IF(ISBLANK($B119),0,VLOOKUP($B119,FullDragonTable,2,0))","v":0},"","","","","","","","","","","","","","","","","","","","","","","","","","","",""]
[115,{"$nulls":9},{"$f":"IF(ISBLANK($B120),0,VLOOKUP($B120,FullDragonTable,2,0))","v":0},"","","","","","","","","","","","","","","","","","","","","","","","","","","",""]
[116,{"$nulls":9},{"$f":"IF(ISBLANK($B121),0,VLOOKUP($B121,FullDragonTable,2,0))","v":0},"","","","","","","","","","","","","","","","","","","","","","","","","","","",""]
[117,{"$nulls":9},{"$f":"IF(ISBLANK($B122),0,VLOOKUP($B122,FullDragonTable,2,0))","v":0},"","","","","","","","","","","","","","","","","","","","","","","","","","","",""]
[118,{"$nulls":9},{"$f":"IF(ISBLANK($B123),0,VLOOKUP($B123,FullDragonTable,2,0))","v":0},"","","","","","","","","","","","","","","","","","","","","","","","","","","",""]
[119,{"$nulls":9},{"$f":"IF(ISBLANK($B124),0,VLOOKUP($B124,FullDragonTable,2,0))","v":0},"","","","","","","","","","","","","","","","","","","","","","","","","","","",""]
[120,{"$nulls":9},{"$f":"IF(ISBLANK($B125),0,VLOOKUP($B125,FullDragonTable,2,0))","v":0},"","","","","","","","","","","","","","","","","","","","","","","","","","","",""]
[121,{"$nulls":9},{"$f":"IF(ISBLANK($B126),0,VLOOKUP($B126,FullDragonTable,2,0))","v":0},"","","","","","","","","","","","","","","","","","","","","","","","","","","",""]
[122,{"$nulls":9},{"$f":"IF(ISBLANK($B127),0,VLOOKUP($B127,FullDragonTable,2,0))","v":0},"","","","","","","","","","","","","","","","","","","","","","","","","","","",""]
[123,{"$nulls":9},{"$f":"IF(ISBLANK($B128),0,VLOOKUP($B128,FullDragonTable,2,0))","v":0},"","","","","","","","","","","","","","","","","","","","","","","","","","","",""]
[124,{"$nulls":9},{"$f":"IF(ISBLANK($B129),0,VLOOKUP($B129,FullDragonTable,2,0))","v":0},"","","","","","","","","","","","","","","","","","","","","","","","","","","",""]
[125,{"$nulls":9},{"$f":"IF(ISBLANK($B130),0,VLOOKUP($B130,FullDragonTable,2,0))","v":0},"","","","","","","","","","","","","","","","","","","","","","","","","","","",""]
[126,{"$nulls":9},{"$f":"IF(ISBLANK($B131),0,VLOOKUP($B131,FullDragonTable,2,0))","v":0},"","","","","","","","","","","","","","","","","","","","","","","","","","","",""]
[127,{"$nulls":9},{"$f":"IF(ISBLANK($B132),0,VLOOKUP($B132,FullDragonTable,2,0))","v":0},"","","","","","","","","","","","","","","","","","","","","","","","","","","",""]
[128,{"$nulls":9},{"$f":"IF(ISBLANK($B133),0,VLOOKUP($B133,FullDragonTable,2,0))","v":0},"","","","","","","","","","","","","","","","","","","","","","","","","","","",""]
[129,{"$nulls":9},{"$f":"IF(ISBLANK($B134),0,VLOOKUP($B134,FullDragonTable,2,0))","v":0},{"$f":"IF(ISBLANK($B134),\"\",IF(ISBLANK(VLOOKUP($B134,FullDragonTable,3,0)),\"\",VLOOKUP($B134,FullDragonTable,3,0)))","v":""},{"$f":"IF(ISBLANK($B134),\"\",IF(ISBLANK(VLOOKUP($B134,FullDragonTable,4,0)),\"\",VLOOKUP($B134,FullDragonTable,4,0)))","v":""},{"$f":"IF(ISBLANK($B134),\"\",IF(ISBLANK(VLOOKUP($B134,FullDragonTable,5,0)),\"\",VLOOKUP($B134,FullDragonTable,5,0)))","v":""},{"$f":"IF(ISBLANK($B134),\"\",IF(ISBLANK(VLOOKUP($B134,FullDragonTable,6,0)),\"\",VLOOKUP($B134,FullDragonTable,6,0)))","v":""},{"$f":"IF(ISBLANK($B134),\"\",VLOOKUP($B134,FullDragonTable,7,0))","v":""},{"$f":"IF(ISBLANK($B134),\"\",VLOOKUP(P134,AttackTable,2,0))","v":""},{"$f":"IF(ISBLANK($B134),\"\",VLOOKUP(P134,AttackTable,3,0))","v":""},{"$f":"IF(ISBLANK($B134),\"\",VLOOKUP($B134,FullDragonTable,8,0))","v":""},{"$f":"IF(ISBLANK($B134),\"\",VLOOKUP(S134,AttackTable,2,0))","v":""},{"$f":"IF(ISBLANK($B134),\"\",VLOOKUP(S134,AttackTable,3,0))","v":""},{"$f":"IF(ISBLANK($B134),\"\",VLOOKUP($B134,FullDragonTable,9,0))","v":""},{"$f":"IF(ISBLANK($B134),\"\",VLOOKUP(V134,AttackTable,2,0))","v":""},{"$f":"IF(ISBLANK($B134),\"\",VLOOKUP(V134,AttackTable,3,0))","v":""},{"$f":"IF(ISBLANK($B134),\"\",VLOOKUP($B134,FullDragonTable,10,0))","v":""},{"$f":"IF(ISBLANK($B134),\"\",VLOOKUP(Y134,AttackTable,2,0))","v":""},{"$f":"IF(ISBLANK($B134),\"\",VLOOKUP(Y134,AttackTable,3,0))","v":""},{"$f":"IF(ISBLANK($B134),\"\",VLOOKUP($B134,FullDragonTable,11,0))","v":""},{"$f":"IF(ISBLANK($B134),\"\",VLOOKUP(AB134,AttackTable,2,0))","v":""},{"$f":"IF(ISBLANK($B134),\"\",VLOOKUP(AB134,AttackTable,3,0))","v":""},{"$f":"IF(ISBLANK($B134),\"\",VLOOKUP($B134,FullDragonTable,12,0))","v":""},{"$f":"IF(ISBLANK($B134),\"\",VLOOKUP(AE134,AttackTable,2,0))","v":""},{"$f":"IF(ISBLANK($B134),\"\",VLOOKUP(AE134,AttackTable,3,0))","v":""},{"$f":"IF(ISBLANK($B134),\"\",VLOOKUP($B134,FullDragonTable,13,0))","v":""},{"$f":"IF(ISBLANK($B134),\"\",VLOOKUP(AH134,AttackTable,2,0))","v":""},{"$f":"IF(ISBLANK($B134),\"\",VLOOKUP(AH134,AttackTable,3,0))","v":""},{"$f":"IF(ISBLANK($B134),\"\",VLOOKUP($B134,FullDragonTable,14,0))","v":""},{"$f":"IF(ISBLANK($B134),\"\",VLOOKUP(AK134,AttackTable,2,0))","v":""},{"$f":"IF(ISBLANK($B134),\"\",VLOOKUP(AK134,AttackTable,3,0))","v":""}]
[130,{"$nulls":9},{"$f":"IF(ISBLANK($B135),0,VLOOKUP($B135,FullDragonTable,2,0))","v":0},"","","","","","","","","","","","","","","","","","","","","","","","","","","",""]
[131,{"$nulls":9},{"$f":"IF(ISBLANK($B136),0,VLOOKUP($B136,FullDragonTable,2,0))","v":0},"","","","","","","","","","","","","","","","","","","","","","","","","","","",""]
[132,{"$nulls":9},{"$f":"IF(ISBLANK($B137),0,VLOOKUP($B137,FullDragonTable,2,0))","v":0},"","","","","","","","","","","","","","","","","","","","","","","","","","","",""]
[133,{"$nulls":9},{"$f":"IF(ISBLANK($B138),0,VLOOKUP($B138,FullDragonTable,2,0))","v":0},"","","","","","","","","","","","","","","","","","","","","","","","","","","",""]
[134,{"$nulls":9},{"$f":"IF(ISBLANK($B139),0,VLOOKUP($B139,FullDragonTable,2,0))","v":0},"","","","","","","","","","","","","","","","","","","","","","","","","","","",""]
[135,{"$nulls":9},{"$f":"IF(ISBLANK($B140),0,VLOOKUP($B140,FullDragonTable,2,0))","v":0},"","","","","","","","","","","","","","","","","","","","","","","","","","","",""]
[136,{"$nulls":9},{"$f":"IF(ISBLANK($B141),0,VLOOKUP($B141,FullDragonTable,2,0))","v":0},"","","","","","","","","","","","","","","","","","","","","","","","","","","",""]
[137,{"$nulls":9},{"$f":"IF(ISBLANK($B142),0,VLOOKUP($B142,FullDragonTable,2,0))","v":0},"","","","","","","","","","","","","","","","","","","","","","","","","","","",""]
[138,{"$nulls":9},{"$f":"IF(ISBLANK($B143),0,VLOOKUP($B143,FullDragonTable,2,0))","v":0},"","","","","","","","","","","","","","","","","","","","","","","","","","","",""]
[139,{"$nulls":9},{"$f":"IF(ISBLANK($B144),0,VLOOKUP($B144,FullDragonTable,2,0))","v":0},"","","","","","","","","","","","","","","","","","","","","","","","","","","",""]
[140,{"$nulls":9},{"$f":"IF(ISBLANK($B145),0,VLOOKUP($B145,FullDragonTable,2,0))","v":0},"","","","","","","","","","","","","","","","","","","","","","","","","","","",""]
[141,{"$nulls":9},{"$f":"IF(ISBLANK($B146),0,VLOOKUP($B146,FullDragonTable,2,0))","v":0},"","","","","","","","","","","","","","","","","","","","","","","","","","","",""]
[142,{"$nulls":9},{"$f":"IF(ISBLANK($B147),0,VLOOKUP($B147,FullDragonTable,2,0))","v":0},"","","","","","","","","","","","","","","","","","","","","","","","","","","",""]
[143,{"$nulls":9},{"$f":"IF(ISBLANK($B148),0,VLOOKUP($B148,FullDragonTable,2,0))","v":0},"","","","","","","","","","","","","","","","","","","","","","","","","","","",""]
[144,{"$nulls":9},{"$f":"IF(ISBLANK($B149),0,VLOOKUP($B149,FullDragonTable,2,0))","v":0},"","","","","","","","","","","","","","","","","","","","","","","","","","","",""]
[145,{"$nulls":9},{"$f":"IF(ISBLANK($B150),0,VLOOKUP($B150,FullDragonTable,2,0))","v":0},"","","","","","","","","","","","","","","","","","","","","","","","","","","",""]
[146,{"$nulls":9},{"$f":"IF(ISBLANK($B151),0,VLOOKUP($B151,FullDragonTable,2,0))","v":0},"","","","","","","","","","","","","","","","","","","","","","","","","","","",""]
[147,{"$nulls":9},{"$f":"IF(ISBLANK($B152),0,VLOOKUP($B152,FullDragonTable,2,0))","v":0},"","","","","","","","","","","","","","","","","","","","","","","","","","","",""]
[148,{"$nulls":9},{"$f":"IF(ISBLANK($B153),0,VLOOKUP($B153,FullDragonTable,2,0))","v":0},"","","","","","","","","","","","","","","","","","","","","","","","","","","",""]
[149,{"$nulls":9},{"$f":"IF(ISBLANK($B154),0,VLOOKUP($B154,FullDragonTable,2,0))","v":0},"","","","","","","","","","","","","","","","","","","","","","","","","","","",""]
[150,{"$nulls":9},{"$f":"IF(ISBLANK($B155),0,VLOOKUP($B155,FullDragonTable,2,0))","v":0},"","","","","","","","","","","","","","","","","","","","","","","","","","","",""]
[151,{"$nulls":9},{"$f":"IF(ISBLANK($B156),0,VLOOKUP($B156,FullDragonTable,2,0))","v":0},"","","","","","","","","","","","","","","","","","","","","","","","","","","",""]
[152,{"$nulls":9},{"$f":"IF(ISBLANK($B157),0,VLOOKUP($B157,FullDragonTable,2,0))","v":0},"","","","","","","","","","","","","","","","","","","","","","","","","","","",""]
[153,{"$nulls":9},{"$f":"IF(ISBLANK($B158),0,VLOOKUP($B158,FullDragonTable,2,0))","v":0},"","","","","","","","","","","","","","","","","","","","","","","","","","","",""]
[154,{"$nulls":9},{"$f":"IF(ISBLANK($B159),0,VLOOKUP($B159,FullDragonTable,2,0))","v":0},"","","","","","","","","","","","","","","","","","","","","","","","","","","",""]
[155,{"$nulls":9},{"$f":"IF(ISBLANK($B160),0,VLOOKUP($B160,FullDragonTable,2,0))","v":0},"","","","","","","","","","","","","","","","","","","","","","","","","","","",""]
[156,{"$nulls":9},{"$f":"IF(ISBLANK($B161),0,VLOOKUP($B161,FullDragonTable,2,0))","v":0},"","","","","","","","","","","","","","","","","","","","","","","","","","","",""]
[157,{"$nulls":9},{"$f":"IF(ISBLANK($B162),0,VLOOKUP($B162,FullDragonTable,2,0))","v":0},"","","","","","","","","","","","","","","","","","","","","","","","","","","",""]
[158,{"$nulls":9},{"$f":"IF(ISBLANK($B163),0,VLOOKUP($B163,FullDragonTable,2,0))","v":0},"","","","","","","","","","","","","","","","","","","","","","","","","","","",""]
[159,{"$nulls":9},{"$f":"IF(ISBLANK($B164),0,VLOOKUP($B164,FullDragonTable,2,0))","v":0},"","","","","","","","","","","","","","","","","","","","","","","","","","","",""]
[160,{"$nulls":9},{"$f":"IF(ISBLANK($B165),0,VLOOKUP($B165,FullDragonTable,2,0))","v":0},"","","","","","","","","","","","","","","","","","","","","","","","","","","",""]
[161,{"$nulls":9},{"$f":"IF(ISBLANK($B166),0,VLOOKUP($B166,FullDragonTable,2,0))","v":0},"","","","","","","","","","","","","","","","","","","","","","","","","","","",""]
[162,{"$nulls":9},{"$f":"IF(ISBLANK($B167),0,VLOOKUP($B167,FullDragonTable,2,0))","v":0},"","","","","","","","","","","","","","","","","","","","","","","","","","","",""]
[163,{"$nulls":9},{"$f":"IF(ISBLANK($B168),0,VLOOKUP($B168,FullDragonTable,2,0))","v":0},"","","","","","","","","","","","","","","","","","","","","","","","","","","",""]
[164,{"$nulls":9},{"$f":"IF(ISBLANK($B169),0,VLOOKUP($B169,FullDragonTable,2,0))","v":0},"","","","","","","","","","","","","","","","","","","","","","","","","","","",""]
[165,{"$nulls":9},{"$f":"IF(ISBLANK($B170),0,VLOOKUP($B170,FullDragonTable,2,0))","v":0},"","","","","","","","","","","","","","","","","","","","","","","","","","","",""]
[166,{"$nulls":9},{"$f":"IF(ISBLANK($B171),0,VLOOKUP($B171,FullDragonTable,2,0))","v":0},"","","","","","","","","","","","","","","","","","","","","","","","","","","",""]
[167,{"$nulls":9},{"$f":"IF(ISBLANK($B172),0,VLOOKUP($B172,FullDragonTable,2,0))","v":0},"","","","","","","","","","","","","","","","","","","","","","","","","","","",""]
[168,{"$nulls":9},{"$f":"IF(ISBLANK($B173),0,VLOOKUP($B173,FullDragonTable,2,0))","v":0},"","","","","","","","","","","","","","","","","","","","","","","","","","","",""]
[169,{"$nulls":9},{"$f":"IF(ISBLANK($B174),0,VLOOKUP($B174,FullDragonTable,2,0))","v":0},"","","","","","","","","","","","","","","","","","","","","","","","","","","",""]
[170,{"$nulls":9},{"$f":"IF(ISBLANK($B175),0,VLOOKUP($B175,FullDragonTable,2,0))","v":0},"","","","","","","","","","","","","","","","","","","","","","","","","","","",""]
[171,{"$nulls":9},{"$f":"IF(ISBLANK($B176),0,VLOOKUP($B176,FullDragonTable,2,0))","v":0},"","","","","","","","","","","","","","","","","","","","","","","","","","","",""]
[172,{"$nulls":9},{"$f":"IF(ISBLANK($B177),0,VLOOKUP($B177,FullDragonTable,2,0))","v":0},"","","","","","","","","","","","","","","","","","","","","","","","","","","",""]
[173,{"$nulls":9},{"$f":"IF(ISBLANK($B178),0,VLOOKUP($B178,FullDragonTable,2,0))","v":0},"","","","","","","","","","","","","","","","","","","","","","","","","","","",""]
[174,{"$nulls":9},{"$f":"IF(ISBLANK($B179),0,VLOOKUP($B179,FullDragonTable,2,0))","v":0},"","","","","","","","","","","","","","","","","","","","","","","","","","","",""]
[175,{"$nulls":9},{"$f":"IF(ISBLANK($B180),0,VLOOKUP($B180,FullDragonTable,2,0))","v":0},"","","","","","","","","","","","","","","","","","","","","","","","","","","",""]
[176,{"$nulls":9},{"$f":"IF(ISBLANK($B181),0,VLOOKUP($B181,FullDragonTable,2,0))","v":0},"","","","","","","","","","","","","","","","","","","","","","","","","","","",""]
[177,{"$nulls":9},{"$f":"IF(ISBLANK($B182),0,VLOOKUP($B182,FullDragonTable,2,0))","v":0},"","","","","","","","","","","","","","","","","","","","","","","","","","","",""]
[178,{"$nulls":9},{"$f":"IF(ISBLANK($B183),0,VLOOKUP($B183,FullDragonTable,2,0))","v":0},"","","","","","","","","","","","","","","","","","","","","","","","","","","",""]
[179,{"$nulls":9},{"$f":"IF(ISBLANK($B184),0,VLOOKUP($B184,FullDragonTable,2,0))","v":0},"","","","","","","","","","","","","","","","","","","","","","","","","","","",""]
[180,{"$nulls":9},{"$f":"IF(ISBLANK($B185),0,VLOOKUP($B185,FullDragonTable,2,0))","v":0},"","","","","","","","","","","","","","","","","","","","","","","","","","","",""]
[181,{"$nulls":9},{"$f":"IF(ISBLANK($B186),0,VLOOKUP($B186,FullDragonTable,2,0))","v":0},"","","","","","","","","","","","","","","","","","","","","","","","","","","",""]
[182,{"$nulls":9},{"$f":"IF(ISBLANK($B187),0,VLOOKUP($B187,FullDragonTable,2,0))","v":0},"","","","","","","","","","","","","","","","","","","","","","","","","","","",""]
[183,{"$nulls":9},{"$f":"IF(ISBLANK($B188),0,VLOOKUP($B188,FullDragonTable,2,0))","v":0},"","","","","","","","","","","","","","","","","","","","","","","","","","","",""]
[184,{"$nulls":9},{"$f":"IF(ISBLANK($B189),0,VLOOKUP($B189,FullDragonTable,2,0))","v":0},"","","","","","","","","","","","","","","","","","","","","","","","","","","",""]
[185,{"$nulls":9},{"$f":"IF(ISBLANK($B190),0,VLOOKUP($B190,FullDragonTable,2,0))","v":0},"","","","","","","","","","","","","","","","","","","","","","","","","","","",""]
[186,{"$nulls":9},{"$f":"IF(ISBLANK($B191),0,VLOOKUP($B191,FullDragonTable,2,0))","v":0},"","","","","","","","","","","","","","","","","","","","","","","","","","","",""]
[187,{"$nulls":9},{"$f":"IF(ISBLANK($B192),0,VLOOKUP($B192,FullDragonTable,2,0))","v":0},"","","","","","","","","","","","","","","","","","","","","","","","","","","",""]
[188,{"$nulls":9},{"$f":"IF(ISBLANK($B193),0,VLOOKUP($B193,FullDragonTable,2,0))","v":0},"","","","","","","","","","","","","","","","","","","","","","","","","","","",""]
[189,{"$nulls":9},{"$f":"IF(ISBLANK($B194),0,VLOOKUP($B194,FullDragonTable,2,0))","v":0},"","","","","","","","","","","","","","","","","","","","","","","","","","","",""]
[190,{"$nulls":9},{"$f":"IF(ISBLANK($B195),0,VLOOKUP($B195,FullDragonTable,2,0))","v":0},"","","","","","","","","","","","","","","","","","","","","","","","","","","",""]
[191,{"$nulls":9},{"$f":"IF(ISBLANK($B196),0,VLOOKUP($B196,FullDragonTable,2,0))","v":0},"","","","","","","","","","","","","","","","","","","","","","","","","","","",""]
[192,{"$nulls":9},{"$f":"IF(ISBLANK($B197),0,VLOOKUP($B197,FullDragonTable,2,0))","v":0},"","","","","","","","","","","","","","","","","","","","","","","","","","","",""]
[193,{"$nulls":9},{"$f":"IF(ISBLANK($B198),0,VLOOKUP($B198,FullDragonTable,2,0))","v":0},{"$f":"IF(ISBLANK($B198),\"\",IF(ISBLANK(VLOOKUP($B198,FullDragonTable,3,0)),\"\",VLOOKUP($B198,FullDragonTable,3,0)))","v":""},{"$f":"IF(ISBLANK($B198),\"\",IF(ISBLANK(VLOOKUP($B198,FullDragonTable,4,0)),\"\",VLOOKUP($B198,FullDragonTable,4,0)))","v":""},{"$f":"IF(ISBLANK($B198),\"\",IF(ISBLANK(VLOOKUP($B198,FullDragonTable,5,0)),\"\",VLOOKUP($B198,FullDragonTable,5,0)))","v":""},{"$f":"IF(ISBLANK($B198),\"\",IF(ISBLANK(VLOOKUP($B198,FullDragonTable,6,0)),\"\",VLOOKUP($B198,FullDragonTable,6,0)))","v":""},{"$f":"IF(ISBLANK($B198),\"\",VLOOKUP($B198,FullDragonTable,7,0))","v":""},{"$f":"IF(ISBLANK($B198),\"\",VLOOKUP(P198,AttackTable,2,0))","v":""},{"$f":"IF(ISBLANK($B198),\"\",VLOOKUP(P198,AttackTable,3,0))","v":""},{"$f":"IF(ISBLANK($B198),\"\",VLOOKUP($B198,FullDragonTable,8,0))","v":""},{"$f":"IF(ISBLANK($B198),\"\",VLOOKUP(S198,AttackTable,2,0))","v":""},{"$f":"IF(ISBLANK($B198),\"\",VLOOKUP(S198,AttackTable,3,0))","v":""},{"$f":"IF(ISBLANK($B198),\"\",VLOOKUP($B198,FullDragonTable,9,0))","v":""},{"$f":"IF(ISBLANK($B198),\"\",VLOOKUP(V198,AttackTable,2,0))","v":""},{"$f":"IF(ISBLANK($B198),\"\",VLOOKUP(V198,AttackTable,3,0))","v":""},{"$f":"IF(ISBLANK($B198),\"\",VLOOKUP($B198,FullDragonTable,10,0))","v":""},{"$f":"IF(ISBLANK($B198),\"\",VLOOKUP(Y198,AttackTable,2,0))","v":""},{"$f":"IF(ISBLANK($B198),\"\",VLOOKUP(Y198,AttackTable,3,0))","v":""},{"$f":"IF(ISBLANK($B198),\"\",VLOOKUP($B198,FullDragonTable,11,0))","v":""},{"$f":"IF(ISBLANK($B198),\"\",VLOOKUP(AB198,AttackTable,2,0))","v":""},{"$f":"IF(ISBLANK($B198),\"\",VLOOKUP(AB198,AttackTable,3,0))","v":""},{"$f":"IF(ISBLANK($B198),\"\",VLOOKUP($B198,FullDragonTable,12,0))","v":""},{"$f":"IF(ISBLANK($B198),\"\",VLOOKUP(AE198,AttackTable,2,0))","v":""},{"$f":"IF(ISBLANK($B198),\"\",VLOOKUP(AE198,AttackTable,3,0))","v":""},{"$f":"IF(ISBLANK($B198),\"\",VLOOKUP($B198,FullDragonTable,13,0))","v":""},{"$f":"IF(ISBLANK($B198),\"\",VLOOKUP(AH198,AttackTable,2,0))","v":""},{"$f":"IF(ISBLANK($B198),\"\",VLOOKUP(AH198,AttackTable,3,0))","v":""},{"$f":"IF(ISBLANK($B198),\"\",VLOOKUP($B198,FullDragonTable,14,0))","v":""},{"$f":"IF(ISBLANK($B198),\"\",VLOOKUP(AK198,AttackTable,2,0))","v":""},{"$f":"IF(ISBLANK($B198),\"\",VLOOKUP(AK198,AttackTable,3,0))","v":""}]
[194,{"$nulls":9},{"$f":"IF(ISBLANK($B199),0,VLOOKUP($B199,FullDragonTable,2,0))","v":0},"","","","","","","","","","","","","","","","","","","","","","","","","","","",""]
[195,{"$nulls":9},{"$f":"IF(ISBLANK($B200),0,VLOOKUP($B200,FullDragonTable,2,0))","v":0},"","","","","","","","","","","","","","","","","","","","","","","","","","","",""]
[196,{"$nulls":9},{"$f":"IF(ISBLANK($B201),0,VLOOKUP($B201,FullDragonTable,2,0))","v":0},"","","","","","","","","","","","","","","","","","","","","","","","","","","",""]
[197,{"$nulls":9},{"$f":"IF(ISBLANK($B202),0,VLOOKUP($B202,FullDragonTable,2,0))","v":0},"","","","","","","","","","","","","","","","","","","","","","","","","","","",""]
[198,{"$nulls":9},{"$f":"IF(ISBLANK($B203),0,VLOOKUP($B203,FullDragonTable,2,0))","v":0},"","","","","","","","","","","","","","","","","","","","","","","","","","","",""]
[199,{"$nulls":9},{"$f":"IF(ISBLANK($B204),0,VLOOKUP($B204,FullDragonTable,2,0))","v":0},"","","","","","","","","","","","","","","","","","","","","","","","","","","",""]
[200,{"$nulls":9},{"$f":"IF(ISBLANK($B205),0,VLOOKUP($B205,FullDragonTable,2,0))","v":0},"","","","","","","","","","","","","","","","","","","","","","","","","","","",""]
[201,{"$nulls":9},{"$f":"IF(ISBLANK($B206),0,VLOOKUP($B206,FullDragonTable,2,0))","v":0},"","","","","","","","","","","","","","","","","","","","","","","","","","","",""]
[202,{"$nulls":9},{"$f":"IF(ISBLANK($B207),0,VLOOKUP($B207,FullDragonTable,2,0))","v":0},"","","","","","","","","","","","","","","","","","","","","","","","","","","",""]
[203,{"$nulls":9},{"$f":"IF(ISBLANK($B208),0,VLOOKUP($B208,FullDragonTable,2,0))","v":0},"","","","","","","","","","","","","","","","","","","","","","","","","","","",""]
[204,{"$nulls":9},{"$f":"IF(ISBLANK($B209),0,VLOOKUP($B209,FullDragonTable,2,0))","v":0},"","","","","","","","","","","","","","","","","","","","","","","","","","","",""]
[205,{"$nulls":9},{"$f":"IF(ISBLANK($B210),0,VLOOKUP($B210,FullDragonTable,2,0))","v":0},"","","","","","","","","","","","","","","","","","","","","","","","","","","",""]
[206,{"$nulls":9},{"$f":"IF(ISBLANK($B211),0,VLOOKUP($B211,FullDragonTable,2,0))","v":0},"","","","","","","","","","","","","","","","","","","","","","","","","","","",""]
[207,{"$nulls":9},{"$f":"IF(ISBLANK($B212),0,VLOOKUP($B212,FullDragonTable,2,0))","v":0},"","","","","","","","","","","","","","","","","","","","","","","","","","","",""]
[208,{"$nulls":9},{"$f":"IF(ISBLANK($B213),0,VLOOKUP($B213,FullDragonTable,2,0))","v":0},"","","","","","","","","","","","","","","","","","","","","","","","","","","",""]
[209,{"$nulls":9},{"$f":"IF(ISBLANK($B214),0,VLOOKUP($B214,FullDragonTable,2,0))","v":0},"","","","","","","","","","","","","","","","","","","","","","","","","","","",""]
[210,{"$nulls":9},{"$f":"IF(ISBLANK($B215),0,VLOOKUP($B215,FullDragonTable,2,0))","v":0},"","","","","","","","","","","","","","","","","","","","","","","","","","","",""]
[211,{"$nulls":9},{"$f":"IF(ISBLANK($B216),0,VLOOKUP($B216,FullDragonTable,2,0))","v":0},"","","","","","","","","","","","","","","","","","","","","","","","","","","",""]
[212,{"$nulls":9},{"$f":"IF(ISBLANK($B217),0,VLOOKUP($B217,FullDragonTable,2,0))","v":0},"","","","","","","","","","","","","","","","","","","","","","","","","","","",""]
[213,{"$nulls":9},{"$f":"IF(ISBLANK($B218),0,VLOOKUP($B218,FullDragonTable,2,0))","v":0},"","","","","","","","","","","","","","","","","","","","","","","","","","","",""]
[214,{"$nulls":9},{"$f":"IF(ISBLANK($B219),0,VLOOKUP($B219,FullDragonTable,2,0))","v":0},"","","","","","","","","","","","","","","","","","","","","","","","","","","",""]
[215,{"$nulls":9},{"$f":"IF(ISBLANK($B220),0,VLOOKUP($B220,FullDragonTable,2,0))","v":0},"","","","","","","","","","","","","","","","","","","","","","","","","","","",""]
[216,{"$nulls":9},{"$f":"IF(ISBLANK($B221),0,VLOOKUP($B221,FullDragonTable,2,0))","v":0},"","","","","","","","","","","","","","","","","","","","","","","","","","","",""]
[217,{"$nulls":9},{"$f":"IF(ISBLANK($B222),0,VLOOKUP($B222,FullDragonTable,2,0))","v":0},"","","","","","","","","","","","","","","","","","","","","","","","","","","",""]
[218,{"$nulls":9},{"$f":"IF(ISBLANK($B223),0,VLOOKUP($B223,FullDragonTable,2,0))","v":0},"","","","","","","","","","","","","","","","","","","","","","","","","","","",""]
[219,{"$nulls":9},{"$f":"IF(ISBLANK($B224),0,VLOOKUP($B224,FullDragonTable,2,0))","v":0},"","","","","","","","","","","","","","","","","","","","","","","","","","","",""]
[220,{"$nulls":9},{"$f":"IF(ISBLANK($B225),0,VLOOKUP($B225,FullDragonTable,2,0))","v":0},"","","","","","","","","","","","","","","","","","","","","","","","","","","",""]
[221,{"$nulls":9},{"$f":"IF(ISBLANK($B226),0,VLOOKUP($B226,FullDragonTable,2,0))","v":0},"","","","","","","","","","","","","","","","","","","","","","","","","","","",""]
[222,{"$nulls":9},{"$f":"IF(ISBLANK($B227),0,VLOOKUP($B227,FullDragonTable,2,0))","v":0},"","","","","","","","","","","","","","","","","","","","","","","","","","","",""]
[223,{"$nulls":9},{"$f":"IF(ISBLANK($B228),0,VLOOKUP($B228,FullDragonTable,2,0))","v":0},"","","","","","","","","","","","","","","","","","","","","","","","","","","",""]
[224,{"$nulls":9},{"$f":"IF(ISBLANK($B229),0,VLOOKUP($B229,FullDragonTable,2,0))","v":0},"","","","","","","","","","","","","","","","","","","","","","","","","","","",""]
[225,{"$nulls":9},{"$f":"IF(ISBLANK($B230),0,VLOOKUP($B230,FullDragonTable,2,0))","v":0},"","","","","","","","","","","","","","","","","","","","","","","","","","","",""]
[226,{"$nulls":9},{"$f":"IF(ISBLANK($B231),0,VLOOKUP($B231,FullDragonTable,2,0))","v":0},"","","","","","","","","","","","","","","","","","","","","","","","","","","",""]
[227,{"$nulls":9},{"$f":"IF(ISBLANK($B232),0,VLOOKUP($B232,FullDragonTable,2,0))","v":0},"","","","","","","","","","","","","","","","","","","","","","","","","","","",""]
[228,{"$nulls":9},{"$f":"IF(ISBLANK($B233),0,VLOOKUP($B233,FullDragonTable,2,0))","v":0},"","","","","","","","","","","","","","","","","","","","","","","","","","","",""]
[229,{"$nulls":9},{"$f":"IF(ISBLANK($B234),0,VLOOKUP($B234,FullDragonTable,2,0))","v":0},"","","","","","","","","","","","","","","","","","","","","","","","","","","",""]
[230,{"$nulls":9},{"$f":"IF(ISBLANK($B235),0,VLOOKUP($B235,FullDragonTable,2,0))","v":0},"","","","","","","","","","","","","","","","","","","","","","","","","","","",""]
[231,{"$nulls":9},{"$f":"IF(ISBLANK($B236),0,VLOOKUP($B236,FullDragonTable,2,0))","v":0},"","","","","","","","","","","","","","","","","","","","","","","","","","","",""]
[232,{"$nulls":9},{"$f":"IF(ISBLANK($B237),0,VLOOKUP($B237,FullDragonTable,2,0))","v":0},"","","","","","","","","","","","","","","","","","","","","","","","","","","",""]
[233,{"$nulls":9},{"$f":"IF(ISBLANK($B238),0,VLOOKUP($B238,FullDragonTable,2,0))","v":0},{"$f":"IF(ISBLANK($B238),\"\",IF(ISBLANK(VLOOKUP($B238,FullDragonTable,3,0)),\"\",VLOOKUP($B238,FullDragonTable,3,0)))","v":""},{"$f":"IF(ISBLANK($B238),\"\",IF(ISBLANK(VLOOKUP($B238,FullDragonTable,4,0)),\"\",VLOOKUP($B238,FullDragonTable,4,0)))","v":""},{"$f":"IF(ISBLANK($B238),\"\",IF(ISBLANK(VLOOKUP($B238,FullDragonTable,5,0)),\"\",VLOOKUP($B238,FullDragonTable,5,0)))","v":""},{"$f":"IF(ISBLANK($B238),\"\",IF(ISBLANK(VLOOKUP($B238,FullDragonTable,6,0)),\"\",VLOOKUP($B238,FullDragonTable,6,0)))","v":""},"","","","","","","","","","","","","","","","","","","","","","","",""]
[234,{"$nulls":9},{"$f":"IF(ISBLANK($B239),0,VLOOKUP($B239,FullDragonTable,2,0))","v":0},"","","","","","","","","","","","","","","","","","","","","","","","","","","",""]
[235,{"$nulls":9},{"$f":"IF(ISBLANK($B240),0,VLOOKUP($B240,FullDragonTable,2,0))","v":0},"","","","","","","","","","","","","","","","","","","","","","","","","","","",""]
[236,{"$nulls":9},{"$f":"IF(ISBLANK($B241),0,VLOOKUP($B241,FullDragonTable,2,0))","v":0},"","","","","","","","","","","","","","","","","","","","","","","","","","","",""]
[237,{"$nulls":9},{"$f":"IF(ISBLANK($B242),0,VLOOKUP($B242,FullDragonTable,2,0))","v":0},"","","","","","","","","","","","","","","","","","","","","","","","","","","",""]
[238,{"$nulls":9},{"$f":"IF(ISBLANK($B243),0,VLOOKUP($B243,FullDragonTable,2,0))","v":0},"","","","","","","","","","","","","","","","","","","","","","","","","","","",""]
[239,{"$nulls":9},{"$f":"IF(ISBLANK($B244),0,VLOOKUP($B244,FullDragonTable,2,0))","v":0},"","","","","","","","","","","","","","","","","","","","","","","","","","","",""]
[240,{"$nulls":9},{"$f":"IF(ISBLANK($B245),0,VLOOKUP($B245,FullDragonTable,2,0))","v":0},"","","","","","","","","","","","","","","","","","","","","","","","","","","",""]
[241,{"$nulls":9},{"$f":"IF(ISBLANK($B246),0,VLOOKUP($B246,FullDragonTable,2,0))","v":0},"","","","","","","","","","","","","","","","","","","","","","","","","","","",""]
[242,{"$nulls":9},{"$f":"IF(ISBLANK($B247),0,VLOOKUP($B247,FullDragonTable,2,0))","v":0},"","","","","","","","","","","","","","","","","","","","","","","","","","","",""]
[243,{"$nulls":9},{"$f":"IF(ISBLANK($B248),0,VLOOKUP($B248,FullDragonTable,2,0))","v":0},"","","","","","","","","","","","","","","","","","","","","","","","","","","",""]
[244,{"$nulls":9},{"$f":"IF(ISBLANK($B249),0,VLOOKUP($B249,FullDragonTable,2,0))","v":0},"","","","","","","","","","","","","","","","","","","","","","","","","","","",""]
[245,{"$nulls":9},{"$f":"IF(ISBLANK($B250),0,VLOOKUP($B250,FullDragonTable,2,0))","v":0},"","","","","","","","","","","","","","","","","","","","","","","","","","","",""]
[246,{"$nulls":9},{"$f":"IF(ISBLANK($B251),0,VLOOKUP($B251,FullDragonTable,2,0))","v":0},"","","","","","","","","","","","","","","","","","","","","","","","","","","",""]
[247,{"$nulls":9},{"$f":"IF(ISBLANK($B252),0,VLOOKUP($B252,FullDragonTable,2,0))","v":0},"","","","","","","","","","","","","","","","","","","","","","","","","","","",""]
[248,{"$nulls":9},{"$f":"IF(ISBLANK($B253),0,VLOOKUP($B253,FullDragonTable,2,0))","v":0},"","","","","","","","","","","","","","","","","","","","","","","","","","","",""]
[249,{"$nulls":9},{"$f":"IF(ISBLANK($B254),0,VLOOKUP($B254,FullDragonTable,2,0))","v":0},"","","","","","","","","","","","","","","","","","","","","","","","","","","",""]
[250,{"$nulls":9},{"$f":"IF(ISBLANK($B255),0,VLOOKUP($B255,FullDragonTable,2,0))","v":0},"","","","","","","","","","","","","","","","","","","","","","","","","","","",""]
[251,{"$nulls":9},{"$f":"IF(ISBLANK($B256),0,VLOOKUP($B256,FullDragonTable,2,0))","v":0},"","","","","","","","","","","","","","","","","","","","","","","","","","","",""]
[252,{"$nulls":9},{"$f":"IF(ISBLANK($B257),0,VLOOKUP($B257,FullDragonTable,2,0))","v":0},"","","","","","","","","","","","","","","","","","","","","","","","","","","",""]
[253,{"$nulls":9},{"$f":"IF(ISBLANK($B258),0,VLOOKUP($B258,FullDragonTable,2,0))","v":0},"","","","","","","","","","","","","","","","","","","","","","","","","","","",""]
[254,{"$nulls":9},{"$f":"IF(ISBLANK($B259),0,VLOOKUP($B259,FullDragonTable,2,0))","v":0},"","","","","","","","","","","","","","","","","","","","","","","","","","","",""]
[255,{"$nulls":9},{"$f":"IF(ISBLANK($B260),0,VLOOKUP($B260,FullDragonTable,2,0))","v":0},"","","","","","","","","","","","","","","","","","","","","","","","","","","",""]
[256,{"$nulls":9},{"$f":"IF(ISBLANK($B261),0,VLOOKUP($B261,FullDragonTable,2,0))","v":0},"","","","","","","","","","","","","","","","","","","","","","","","","","","",""]
[257,{"$nulls":9},{"$f":"IF(ISBLANK($B262),0,VLOOKUP($B262,FullDragonTable,2,0))","v":0},{"$f":"IF(ISBLANK($B262),\"\",IF(ISBLANK(VLOOKUP($B262,FullDragonTable,3,0)),\"\",VLOOKUP($B262,FullDragonTable,3,0)))","v":""},{"$f":"IF(ISBLANK($B262),\"\",IF(ISBLANK(VLOOKUP($B262,FullDragonTable,4,0)),\"\",VLOOKUP($B262,FullDragonTable,4,0)))","v":""},{"$f":"IF(ISBLANK($B262),\"\",IF(ISBLANK(VLOOKUP($B262,FullDragonTable,5,0)),\"\",VLOOKUP($B262,FullDragonTable,5,0)))","v":""},{"$f":"IF(ISBLANK($B262),\"\",IF(ISBLANK(VLOOKUP($B262,FullDragonTable,6,0)),\"\",VLOOKUP($B262,FullDragonTable,6,0)))","v":""},{"$f":"IF(ISBLANK($B262),\"\",VLOOKUP($B262,FullDragonTable,7,0))","v":""},{"$f":"IF(ISBLANK($B262),\"\",VLOOKUP(P262,AttackTable,2,0))","v":""},{"$f":"IF(ISBLANK($B262),\"\",VLOOKUP(P262,AttackTable,3,0))","v":""},{"$f":"IF(ISBLANK($B262),\"\",VLOOKUP($B262,FullDragonTable,8,0))","v":""},{"$f":"IF(ISBLANK($B262),\"\",VLOOKUP(S262,AttackTable,2,0))","v":""},{"$f":"IF(ISBLANK($B262),\"\",VLOOKUP(S262,AttackTable,3,0))","v":""},{"$f":"IF(ISBLANK($B262),\"\",VLOOKUP($B262,FullDragonTable,9,0))","v":""},{"$f":"IF(ISBLANK($B262),\"\",VLOOKUP(V262,AttackTable,2,0))","v":""},{"$f":"IF(ISBLANK($B262),\"\",VLOOKUP(V262,AttackTable,3,0))","v":""},{"$f":"IF(ISBLANK($B262),\"\",VLOOKUP($B262,FullDragonTable,10,0))","v":""},{"$f":"IF(ISBLANK($B262),\"\",VLOOKUP(Y262,AttackTable,2,0))","v":""},{"$f":"IF(ISBLANK($B262),\"\",VLOOKUP(Y262,AttackTable,3,0))","v":""},{"$f":"IF(ISBLANK($B262),\"\",VLOOKUP($B262,FullDragonTable,11,0))","v":""},{"$f":"IF(ISBLANK($B262),\"\",VLOOKUP(AB262,AttackTable,2,0))","v":""},{"$f":"IF(ISBLANK($B262),\"\",VLOOKUP(AB262,AttackTable,3,0))","v":""},{"$f":"IF(ISBLANK($B262),\"\",VLOOKUP($B262,FullDragonTable,12,0))","v":""},{"$f":"IF(ISBLANK($B262),\"\",VLOOKUP(AE262,AttackTable,2,0))","v":""},{"$f":"IF(ISBLANK($B262),\"\",VLOOKUP(AE262,AttackTable,3,0))","v":""},{"$f":"IF(ISBLANK($B262),\"\",VLOOKUP($B262,FullDragonTable,13,0))","v":""},{"$f":"IF(ISBLANK($B262),\"\",VLOOKUP(AH262,AttackTable,2,0))","v":""},{"$f":"IF(ISBLANK($B262),\"\",VLOOKUP(AH262,AttackTable,3,0))","v":""},{"$f":"IF(ISBLANK($B262),\"\",VLOOKUP($B262,FullDragonTable,14,0))","v":""},{"$f":"IF(ISBLANK($B262),\"\",VLOOKUP(AK262,AttackTable,2,0))","v":""},{"$f":"IF(ISBLANK($B262),\"\",VLOOKUP(AK262,AttackTable,3,0))","v":""}]
[258,{"$nulls":9},{"$f":"IF(ISBLANK($B263),0,VLOOKUP($B263,FullDragonTable,2,0))","v":0},"","","","","","","","","","","","","","","","","","","","","","","","","","","",""]
[259,{"$nulls":9},{"$f":"IF(ISBLANK($B264),0,VLOOKUP($B264,FullDragonTable,2,0))","v":0},"","","","","","","","","","","","","","","","","","","","","","","","","","","",""]
[260,{"$nulls":9},{"$f":"IF(ISBLANK($B265),0,VLOOKUP($B265,FullDragonTable,2,0))","v":0},"","","","","","","","","","","","","","","","","","","","","","","","","","","",""]
[261,{"$nulls":9},{"$f":"IF(ISBLANK($B266),0,VLOOKUP($B266,FullDragonTable,2,0))","v":0},"","","","","","","","","","","","","","","","","","","","","","","","","","","",""]
[262,{"$nulls":9},{"$f":"IF(ISBLANK($B267),0,VLOOKUP($B267,FullDragonTable,2,0))","v":0},"","","","","","","","","","","","","","","","","","","","","","","","","","","",""]
[263,{"$nulls":9},{"$f":"IF(ISBLANK($B268),0,VLOOKUP($B268,FullDragonTable,2,0))","v":0},"","","","","","","","","","","","","","","","","","","","","","","","","","","",""]
[264,{"$nulls":9},{"$f":"IF(ISBLANK($B269),0,VLOOKUP($B269,FullDragonTable,2,0))","v":0},"","","","","","","","","","","","","","","","","","","","","","","","","","","",""]
[265,{"$nulls":9},{"$f":"IF(ISBLANK($B270),0,VLOOKUP($B270,FullDragonTable,2,0))","v":0},"","","","","","","","","","","","","","","","","","","","","","","","","","","",""]
[266,{"$nulls":9},{"$f":"IF(ISBLANK($B271),0,VLOOKUP($B271,FullDragonTable,2,0))","v":0},"","","","","","","","","","","","","","","","","","","","","","","","","","","",""]
[267,{"$nulls":9},{"$f":"IF(ISBLANK($B272),0,VLOOKUP($B272,FullDragonTable,2,0))","v":0},"","","","","","","","","","","","","","","","","","","","","","","","","","","",""]
[268,{"$nulls":9},{"$f":"IF(ISBLANK($B273),0,VLOOKUP($B273,FullDragonTable,2,0))","v":0},"","","","","","","","","","","","","","","","","","","","","","","","","","","",""]
[269,{"$nulls":9},{"$f":"IF(ISBLANK($B274),0,VLOOKUP($B274,FullDragonTable,2,0))","v":0},"","","","","","","","","","","","","","","","","","","","","","","","","","","",""]
[270,{"$nulls":9},{"$f":"IF(ISBLANK($B275),0,VLOOKUP($B275,FullDragonTable,2,0))","v":0},"","","","","","","","","","","","","","","","","","","","","","","","","","","",""]
[271,{"$nulls":9},{"$f":"IF(ISBLANK($B276),0,VLOOKUP($B276,FullDragonTable,2,0))","v":0},"","","","","","","","","","","","","","","","","","","","","","","","","","","",""]
[272,{"$nulls":9},{"$f":"IF(ISBLANK($B277),0,VLOOKUP($B277,FullDragonTable,2,0))","v":0},"","","","","","","","","","","","","","","","","","","","","","","","","","","",""]
[273,{"$nulls":9},{"$f":"IF(ISBLANK($B278),0,VLOOKUP($B278,FullDragonTable,2,0))","v":0},"","","","","","","","","","","","","","","","","","","","","","","","","","","",""]
[274,{"$nulls":9},{"$f":"IF(ISBLANK($B279),0,VLOOKUP($B279,FullDragonTable,2,0))","v":0},"","","","","","","","","","","","","","","","","","","","","","","","","","","",""]
[275,{"$nulls":9},{"$f":"IF(ISBLANK($B280),0,VLOOKUP($B280,FullDragonTable,2,0))","v":0},"","","","","","","","","","","","","","","","","","","","","","","","","","","",""]
[276,{"$nulls":9},{"$f":"IF(ISBLANK($B281),0,VLOOKUP($B281,FullDragonTable,2,0))","v":0},"","","","","","","","","","","","","","","","","","","","","","","","","","","",""]
[277,{"$nulls":9},{"$f":"IF(ISBLANK($B282),0,VLOOKUP($B282,FullDragonTable,2,0))","v":0},"","","","","","","","","","","","","","","","","","","","","","","","","","","",""]
[278,{"$nulls":9},{"$f":"IF(ISBLANK($B283),0,VLOOKUP($B283,FullDragonTable,2,0))","v":0},"","","","","","","","","","","","","","","","","","","","","","","","","","","",""]
[279,{"$nulls":9},{"$f":"IF(ISBLANK($B284),0,VLOOKUP($B284,FullDragonTable,2,0))","v":0},"","","","","","","","","","","","","","","","","","","","","","","","","","","",""]
[280,{"$nulls":9},{"$f":"IF(ISBLANK($B285),0,VLOOKUP($B285,FullDragonTable,2,0))","v":0},"","","","","","","","","","","","","","","","","","","","","","","","","","","",""]
[281,{"$nulls":9},{"$f":"IF(ISBLANK($B286),0,VLOOKUP($B286,FullDragonTable,2,0))","v":0},"","","","","","","","","","","","","","","","","","","","","","","","","","","",""]
[282,{"$nulls":9},{"$f":"IF(ISBLANK($B287),0,VLOOKUP($B287,FullDragonTable,2,0))","v":0},"","","","","","","","","","","","","","","","","","","","","","","","","","","",""]
[283,{"$nulls":9},{"$f":"IF(ISBLANK($B288),0,VLOOKUP($B288,FullDragonTable,2,0))","v":0},"","","","","","","","","","","","","","","","","","","","","","","","","","","",""]
[284,{"$nulls":9},{"$f":"IF(ISBLANK($B289),0,VLOOKUP($B289,FullDragonTable,2,0))","v":0},"","","","","","","","","","","","","","","","","","","","","","","","","","","",""]
[285,{"$nulls":9},{"$f":"IF(ISBLANK($B290),0,VLOOKUP($B290,FullDragonTable,2,0))","v":0},"","","","","","","","","","","","","","","","","","","","","","","","","","","",""]
[286,{"$nulls":9},{"$f":"IF(ISBLANK($B291),0,VLOOKUP($B291,FullDragonTable,2,0))","v":0},"","","","","","","","","","","","","","","","","","","","","","","","","","","",""]
[287,{"$nulls":9},{"$f":"IF(ISBLANK($B292),0,VLOOKUP($B292,FullDragonTable,2,0))","v":0},"","","","","","","","","","","","","","","","","","","","","","","","","","","",""]
[288,{"$nulls":9},{"$f":"IF(ISBLANK($B293),0,VLOOKUP($B293,FullDragonTable,2,0))","v":0},"","","","","","","","","","","","","","","","","","","","","","","","","","","",""]
[289,{"$nulls":9},{"$f":"IF(ISBLANK($B294),0,VLOOKUP($B294,FullDragonTable,2,0))","v":0},"","","","","","","","","","","","","","","","","","","","","","","","","","","",""]
[290,{"$nulls":9},{"$f":"IF(ISBLANK($B295),0,VLOOKUP($B295,FullDragonTable,2,0))","v":0},"","","","","","","","","","","","","","","","","","","","","","","","","","","",""]
[291,{"$nulls":9},{"$f":"IF(ISBLANK($B296),0,VLOOKUP($B296,FullDragonTable,2,0))","v":0},"","","","","","","","","","","","","","","","","","","","","","","","","","","",""]
[292,{"$nulls":9},{"$f":"IF(ISBLANK($B297),0,VLOOKUP($B297,FullDragonTable,2,0))","v":0},"","","","","","","","","","","","","","","","","","","","","","","","","","","",""]
[293,{"$nulls":9},{"$f":"IF(ISBLANK($B298),0,VLOOKUP($B298,FullDragonTable,2,0))","v":0},"","","","","","","","","","","","","","","","","","","","","","","","","","","",""]
[294,{"$nulls":9},{"$f":"IF(ISBLANK($B299),0,VLOOKUP($B299,FullDragonTable,2,0))","v":0},"","","","","","","","","","","","","","","","","","","","","","","","","","","",""]
[295,{"$nulls":9},{"$f":"IF(ISBLANK($B300),0,VLOOKUP($B300,FullDragonTable,2,0))","v":0},"","","","","","","","","","","","","","","","","","","","","","","","","","","",""]
[296,{"$nulls":9},{"$f":"IF(ISBLANK($B301),0,VLOOKUP($B301,FullDragonTable,2,0))","v":0},"","","","","","","","","","","","","","","","","","","","","","","","","","","",""]
[297,{"$nulls":9},{"$f":"IF(ISBLANK($B302),0,VLOOKUP($B302,FullDragonTable,2,0))","v":0},"","","","","","","","","","","","","","","","","","","","","","","","","","","",""]
[298,{"$nulls":9},{"$f":"IF(ISBLANK($B303),0,VLOOKUP($B303,FullDragonTable,2,0))","v":0},"","","","","","","","","","","","","","","","","","","","","","","","","","","",""]
[299,{"$nulls":9},{"$f":"IF(ISBLANK($B304),0,VLOOKUP($B304,FullDragonTable,2,0))","v":0},"","","","","","","","","","","","","","","","","","","","","","","","","","","",""]
[300,{"$nulls":9},{"$f":"IF(ISBLANK($B305),0,VLOOKUP($B305,FullDragonTable,2,0))","v":0},"","","","","","","","","","","","","","","","","","","","","","","","","","","",""]
[301,{"$nulls":9},{"$f":"IF(ISBLANK($B306),0,VLOOKUP($B306,FullDragonTable,2,0))","v":0},"","","","","","","","","","","","","","","","","","","","","","","","","","","",""]
[302,{"$nulls":9},{"$f":"IF(ISBLANK($B307),0,VLOOKUP($B307,FullDragonTable,2,0))","v":0},"","","","","","","","","","","","","","","","","","","","","","","","","","","",""]
[303,{"$nulls":9},{"$f":"IF(ISBLANK($B308),0,VLOOKUP($B308,FullDragonTable,2,0))","v":0},"","","","","","","","","","","","","","","","","","","","","","","","","","","",""]
[304,{"$nulls":9},{"$f":"IF(ISBLANK($B309),0,VLOOKUP($B309,FullDragonTable,2,0))","v":0},"","","","","","","","","","","","","","","","","","","","","","","","","","","",""]
[305,{"$nulls":9},{"$f":"IF(ISBLANK($B310),0,VLOOKUP($B310,FullDragonTable,2,0))","v":0},"","","","","","","","","","","","","","","","","","","","","","","","","","","",""]
[306,{"$nulls":9},{"$f":"IF(ISBLANK($B311),0,VLOOKUP($B311,FullDragonTable,2,0))","v":0},"","","","","","","","","","","","","","","","","","","","","","","","","","","",""]
[307,{"$nulls":9},{"$f":"IF(ISBLANK($B312),0,VLOOKUP($B312,FullDragonTable,2,0))","v":0},"","","","","","","","","","","","","","","","","","","","","","","","","","","",""]
[308,{"$nulls":9},{"$f":"IF(ISBLANK($B313),0,VLOOKUP($B313,FullDragonTable,2,0))","v":0},"","","","","","","","","","","","","","","","","","","","","","","","","","","",""]
[309,{"$nulls":9},{"$f":"IF(ISBLANK($B314),0,VLOOKUP($B314,FullDragonTable,2,0))","v":0},"","","","","","","","","","","","","","","","","","","","","","","","","","","",""]
[310,{"$nulls":9},{"$f":"IF(ISBLANK($B315),0,VLOOKUP($B315,FullDragonTable,2,0))","v":0},"","","","","","","","","","","","","","","","","","","","","","","","","","","",""]
[311,{"$nulls":9},{"$f":"IF(ISBLANK($B316),0,VLOOKUP($B316,FullDragonTable,2,0))","v":0},"","","","","","","","","","","","","","","","","","","","","","","","","","","",""]
[312,{"$nulls":9},{"$f":"IF(ISBLANK($B317),0,VLOOKUP($B317,FullDragonTable,2,0))","v":0},"","","","","","","","","","","","","","","","","","","","","","","","","","","",""]
[313,{"$nulls":9},{"$f":"IF(ISBLANK($B318),0,VLOOKUP($B318,FullDragonTable,2,0))","v":0},"","","","","","","","","","","","","","","","","","","","","","","","","","","",""]
[314,{"$nulls":9},{"$f":"IF(ISBLANK($B319),0,VLOOKUP($B319,FullDragonTable,2,0))","v":0},"","","","","","","","","","","","","","","","","","","","","","","","","","","",""]
[315,{"$nulls":9},{"$f":"IF(ISBLANK($B320),0,VLOOKUP($B320,FullDragonTable,2,0))","v":0},"","","","","","","","","","","","","","","","","","","","","","","","","","","",""]
[316,{"$nulls":9},{"$f":"IF(ISBLANK($B321),0,VLOOKUP($B321,FullDragonTable,2,0))","v":0},"","","","","","","","","","","","","","","","","","","","","","","","","","","",""]
[317,{"$nulls":9},{"$f":"IF(ISBLANK($B322),0,VLOOKUP($B322,FullDragonTable,2,0))","v":0},"","","","","","","","","","","","","","","","","","","","","","","","","","","",""]
[318,{"$nulls":9},{"$f":"IF(ISBLANK($B323),0,VLOOKUP($B323,FullDragonTable,2,0))","v":0},"","","","","","","","","","","","","","","","","","","","","","","","","","","",""]
[319,{"$nulls":9},{"$f":"IF(ISBLANK($B324),0,VLOOKUP($B324,FullDragonTable,2,0))","v":0},"","","","","","","","","","","","","","","","","","","","","","","","","","","",""]
[320,{"$nulls":9},{"$f":"IF(ISBLANK($B325),0,VLOOKUP($B325,FullDragonTable,2,0))","v":0},"","","","","","","","","","","","","","","","","","","","","","","","","","","",""]
[321,{"$nulls":9},{"$f":"IF(ISBLANK($B326),0,VLOOKUP($B326,FullDragonTable,2,0))","v":0},{"$f":"IF(ISBLANK($B326),\"\",IF(ISBLANK(VLOOKUP($B326,FullDragonTable,3,0)),\"\",VLOOKUP($B326,FullDragonTable,3,0)))","v":""},{"$f":"IF(ISBLANK($B326),\"\",IF(ISBLANK(VLOOKUP($B326,FullDragonTable,4,0)),\"\",VLOOKUP($B326,FullDragonTable,4,0)))","v":""},{"$f":"IF(ISBLANK($B326),\"\",IF(ISBLANK(VLOOKUP($B326,FullDragonTable,5,0)),\"\",VLOOKUP($B326,FullDragonTable,5,0)))","v":""},{"$f":"IF(ISBLANK($B326),\"\",IF(ISBLANK(VLOOKUP($B326,FullDragonTable,6,0)),\"\",VLOOKUP($B326,FullDragonTable,6,0)))","v":""},{"$f":"IF(ISBLANK($B326),\"\",VLOOKUP($B326,FullDragonTable,7,0))","v":""},{"$f":"IF(ISBLANK($B326),\"\",VLOOKUP(P326,AttackTable,2,0))","v":""},{"$f":"IF(ISBLANK($B326),\"\",VLOOKUP(P326,AttackTable,3,0))","v":""},{"$f":"IF(ISBLANK($B326),\"\",VLOOKUP($B326,FullDragonTable,8,0))","v":""},{"$f":"IF(ISBLANK($B326),\"\",VLOOKUP(S326,AttackTable,2,0))","v":""},{"$f":"IF(ISBLANK($B326),\"\",VLOOKUP(S326,AttackTable,3,0))","v":""},{"$f":"IF(ISBLANK($B326),\"\",VLOOKUP($B326,FullDragonTable,9,0))","v":""},{"$f":"IF(ISBLANK($B326),\"\",VLOOKUP(V326,AttackTable,2,0))","v":""},{"$f":"IF(ISBLANK($B326),\"\",VLOOKUP(V326,AttackTable,3,0))","v":""},{"$f":"IF(ISBLANK($B326),\"\",VLOOKUP($B326,FullDragonTable,10,0))","v":""},{"$f":"IF(ISBLANK($B326),\"\",VLOOKUP(Y326,AttackTable,2,0))","v":""},{"$f":"IF(ISBLANK($B326),\"\",VLOOKUP(Y326,AttackTable,3,0))","v":""},{"$f":"IF(ISBLANK($B326),\"\",VLOOKUP($B326,FullDragonTable,11,0))","v":""},{"$f":"IF(ISBLANK($B326),\"\",VLOOKUP(AB326,AttackTable,2,0))","v":""},{"$f":"IF(ISBLANK($B326),\"\",VLOOKUP(AB326,AttackTable,3,0))","v":""},{"$f":"IF(ISBLANK($B326),\"\",VLOOKUP($B326,FullDragonTable,12,0))","v":""},{"$f":"IF(ISBLANK($B326),\"\",VLOOKUP(AE326,AttackTable,2,0))","v":""},{"$f":"IF(ISBLANK($B326),\"\",VLOOKUP(AE326,AttackTable,3,0))","v":""},{"$f":"IF(ISBLANK($B326),\"\",VLOOKUP($B326,FullDragonTable,13,0))","v":""},{"$f":"IF(ISBLANK($B326),\"\",VLOOKUP(AH326,AttackTable,2,0))","v":""},{"$f":"IF(ISBLANK($B326),\"\",VLOOKUP(AH326,AttackTable,3,0))","v":""},{"$f":"IF(ISBLANK($B326),\"\",VLOOKUP($B326,FullDragonTable,14,0))","v":""},{"$f":"IF(ISBLANK($B326),\"\",VLOOKUP(AK326,AttackTable,2,0))","v":""},{"$f":"IF(ISBLANK($B326),\"\",VLOOKUP(AK326,AttackTable,3,0))","v":""}]
[322,{"$nulls":9},{"$f":"IF(ISBLANK($B327),0,VLOOKUP($B327,FullDragonTable,2,0))","v":0},"","","","","","","","","","","","","","","","","","","","","","","","","","","",""]
[323,{"$nulls":9},{"$f":"IF(ISBLANK($B328),0,VLOOKUP($B328,FullDragonTable,2,0))","v":0},"","","","","","","","","","","","","","","","","","","","","","","","","","","",""]
[324,{"$nulls":9},{"$f":"IF(ISBLANK($B329),0,VLOOKUP($B329,FullDragonTable,2,0))","v":0},"","","","","","","","","","","","","","","","","","","","","","","","","","","",""]
[325,{"$nulls":9},{"$f":"IF(ISBLANK($B330),0,VLOOKUP($B330,FullDragonTable,2,0))","v":0},"","","","","","","","","","","","","","","","","","","","","","","","","","","",""]
[326,{"$nulls":9},{"$f":"IF(ISBLANK($B331),0,VLOOKUP($B331,FullDragonTable,2,0))","v":0},"","","","","","","","","","","","","","","","","","","","","","","","","","","",""]
[327,{"$nulls":9},{"$f":"IF(ISBLANK($B332),0,VLOOKUP($B332,FullDragonTable,2,0))","v":0},"","","","","","","","","","","","","","","","","","","","","","","","","","","",""]
[328,{"$nulls":9},{"$f":"IF(ISBLANK($B333),0,VLOOKUP($B333,FullDragonTable,2,0))","v":0},"","","","","","","","","","","","","","","","","","","","","","","","","","","",""]
[329,{"$nulls":9},{"$f":"IF(ISBLANK($B334),0,VLOOKUP($B334,FullDragonTable,2,0))","v":0},"","","","","","","","","","","","","","","","","","","","","","","","","","","",""]
[330,{"$nulls":9},{"$f":"IF(ISBLANK($B335),0,VLOOKUP($B335,FullDragonTable,2,0))","v":0},"","","","","","","","","","","","","","","","","","","","","","","","","","","",""]
[331,{"$nulls":9},{"$f":"IF(ISBLANK($B336),0,VLOOKUP($B336,FullDragonTable,2,0))","v":0},"","","","","","","","","","","","","","","","","","","","","","","","","","","",""]
[332,{"$nulls":9},{"$f":"IF(ISBLANK($B337),0,VLOOKUP($B337,FullDragonTable,2,0))","v":0},"","","","","","","","","","","","","","","","","","","","","","","","","","","",""]
[333,{"$nulls":9},{"$f":"IF(ISBLANK($B338),0,VLOOKUP($B338,FullDragonTable,2,0))","v":0},"","","","","","","","","","","","","","","","","","","","","","","","","","","",""]
[334,{"$nulls":9},{"$f":"IF(ISBLANK($B339),0,VLOOKUP($B339,FullDragonTable,2,0))","v":0},"","","","","","","","","","","","","","","","","","","","","","","","","","","",""]
[335,{"$nulls":9},{"$f":"IF(ISBLANK($B340),0,VLOOKUP($B340,FullDragonTable,2,0))","v":0},"","","","","","","","","","","","","","","","","","","","","","","","","","","",""]
[336,{"$nulls":9},{"$f":"IF(ISBLANK($B341),0,VLOOKUP($B341,FullDragonTable,2,0))","v":0},"","","","","","","","","","","","","","","","","","","","","","","","","","","",""]
[337,{"$nulls":9},{"$f":"IF(ISBLANK($B342),0,VLOOKUP($B342,FullDragonTable,2,0))","v":0},"","","","","","","","","","","","","","","","","","","","","","","","","","","",""]
[338,{"$nulls":9},{"$f":"IF(ISBLANK($B343),0,VLOOKUP($B343,FullDragonTable,2,0))","v":0},"","","","","","","","","","","","","","","","","","","","","","","","","","","",""]
[339,{"$nulls":9},{"$f":"IF(ISBLANK($B344),0,VLOOKUP($B344,FullDragonTable,2,0))","v":0},"","","","","","","","","","","","","","","","","","","","","","","","","","","",""]
[340,{"$nulls":9},{"$f":"IF(ISBLANK($B345),0,VLOOKUP($B345,FullDragonTable,2,0))","v":0},"","","","","","","","","","","","","","","","","","","","","","","","","","","",""]
[341,{"$nulls":9},{"$f":"IF(ISBLANK($B346),0,VLOOKUP($B346,FullDragonTable,2,0))","v":0},"","","","","","","","","","","","","","","","","","","","","","","","","","","",""]
[342,{"$nulls":9},{"$f":"IF(ISBLANK($B347),0,VLOOKUP($B347,FullDragonTable,2,0))","v":0},"","","","","","","","","","","","","","","","","","","","","","","","","","","",""]
[343,{"$nulls":9},{"$f":"IF(ISBLANK($B348),0,VLOOKUP($B348,FullDragonTable,2,0))","v":0},"","","","","","","","","","","","","","","","","","","","","","","","","","","",""]
[344,{"$nulls":9},{"$f":"IF(ISBLANK($B349),0,VLOOKUP($B349,FullDragonTable,2,0))","v":0},"","","","","","","","","","","","","","","","","","","","","","","","","","","",""]
[345,{"$nulls":9},{"$f":"IF(ISBLANK($B350),0,VLOOKUP($B350,FullDragonTable,2,0))","v":0},"","","","","","","","","","","","","","","","","","","","","","","","","","","",""]
[346,{"$nulls":9},{"$f":"IF(ISBLANK($B351),0,VLOOKUP($B351,FullDragonTable,2,0))","v":0},"","","","","","","","","","","","","","","","","","","","","","","","","","","",""]
[347,{"$nulls":9},{"$f":"IF(ISBLANK($B352),0,VLOOKUP($B352,FullDragonTable,2,0))","v":0},"","","","","","","","","","","","","","","","","","","","","","","","","","","",""]
[348,{"$nulls":9},{"$f":"IF(ISBLANK($B353),0,VLOOKUP($B353,FullDragonTable,2,0))","v":0},"","","","","","","","","","","","","","","","","","","","","","","","","","","",""]
[349,{"$nulls":9},{"$f":"IF(ISBLANK($B354),0,VLOOKUP($B354,FullDragonTable,2,0))","v":0},"","","","","","","","","","","","","","","","","","","","","","","","","","","",""]
[350,{"$nulls":9},{"$f":"IF(ISBLANK($B355),0,VLOOKUP($B355,FullDragonTable,2,0))","v":0},"","","","","","","","","","","","","","","","","","","","","","","","","","","",""]
[351,{"$nulls":9},{"$f":"IF(ISBLANK($B356),0,VLOOKUP($B356,FullDragonTable,2,0))","v":0},"","","","","","","","","","","","","","","","","","","","","","","","","","","",""]
[352,{"$nulls":9},{"$f":"IF(ISBLANK($B357),0,VLOOKUP($B357,FullDragonTable,2,0))","v":0},"","","","","","","","","","","","","","","","","","","","","","","","","","","",""]
[353,{"$nulls":9},{"$f":"IF(ISBLANK($B358),0,VLOOKUP($B358,FullDragonTable,2,0))","v":0},"","","","","","","","","","","","","","","","","","","","","","","","","","","",""]
[354,{"$nulls":9},{"$f":"IF(ISBLANK($B359),0,VLOOKUP($B359,FullDragonTable,2,0))","v":0},"","","","","","","","","","","","","","","","","","","","","","","","","","","",""]
[355,{"$nulls":9},{"$f":"IF(ISBLANK($B360),0,VLOOKUP($B360,FullDragonTable,2,0))","v":0},"","","","","","","","","","","","","","","","","","","","","","","","","","","",""]
[356,{"$nulls":9},{"$f":"IF(ISBLANK($B361),0,VLOOKUP($B361,FullDragonTable,2,0))","v":0},"","","","","","","","","","","","","","","","","","","","","","","","","","","",""]
[357,{"$nulls":9},{"$f":"IF(ISBLANK($B362),0,VLOOKUP($B362,FullDragonTable,2,0))","v":0},"","","","","","","","","","","","","","","","","","","","","","","","","","","",""]
[358,{"$nulls":9},{"$f":"IF(ISBLANK($B363),0,VLOOKUP($B363,FullDragonTable,2,0))","v":0},"","","","","","","","","","","","","","","","","","","","","","","","","","","",""]
[359,{"$nulls":9},{"$f":"IF(ISBLANK($B364),0,VLOOKUP($B364,FullDragonTable,2,0))","v":0},"","","","","","","","","","","","","","","","","","","","","","","","","","","",""]
[360,{"$nulls":9},{"$f":"IF(ISBLANK($B365),0,VLOOKUP($B365,FullDragonTable,2,0))","v":0},"","","","","","","","","","","","","","","","","","","","","","","","","","","",""]
[361,{"$nulls":9},{"$f":"IF(ISBLANK($B366),0,VLOOKUP($B366,FullDragonTable,2,0))","v":0},"","","","","","","","","","","","","","","","","","","","","","","","","","","",""]
[362,{"$nulls":9},{"$f":"IF(ISBLANK($B367),0,VLOOKUP($B367,FullDragonTable,2,0))","v":0},"","","","","","","","","","","","","","","","","","","","","","","","","","","",""]
[363,{"$nulls":9},{"$f":"IF(ISBLANK($B368),0,VLOOKUP($B368,FullDragonTable,2,0))","v":0},"","","","","","","","","","","","","","","","","","","","","","","","","","","",""]
[364,{"$nulls":9},{"$f":"IF(ISBLANK($B369),0,VLOOKUP($B369,FullDragonTable,2,0))","v":0},"","","","","","","","","","","","","","","","","","","","","","","","","","","",""]
[365,{"$nulls":9},{"$f":"IF(ISBLANK($B370),0,VLOOKUP($B370,FullDragonTable,2,0))","v":0},"","","","","","","","","","","","","","","","","","","","","","","","","","","",""]
[366,{"$nulls":9},{"$f":"IF(ISBLANK($B371),0,VLOOKUP($B371,FullDragonTable,2,0))","v":0},"","","","","","","","","","","","","","","","","","","","","","","","","","","",""]
[367,{"$nulls":9},{"$f":"IF(ISBLANK($B372),0,VLOOKUP($B372,FullDragonTable,2,0))","v":0},"","","","","","","","","","","","","","","","","","","","","","","","","","","",""]
[368,{"$nulls":9},{"$f":"IF(ISBLANK($B373),0,VLOOKUP($B373,FullDragonTable,2,0))","v":0},"","","","","","","","","","","","","","","","","","","","","","","","","","","",""]
[369,{"$nulls":9},{"$f":"IF(ISBLANK($B374),0,VLOOKUP($B374,FullDragonTable,2,0))","v":0},"","","","","","","","","","","","","","","","","","","","","","","","","","","",""]
[370,{"$nulls":9},{"$f":"IF(ISBLANK($B375),0,VLOOKUP($B375,FullDragonTable,2,0))","v":0},"","","","","","","","","","","","","","","","","","","","","","","","","","","",""]
[371,{"$nulls":9},{"$f":"IF(ISBLANK($B376),0,VLOOKUP($B376,FullDragonTable,2,0))","v":0},"","","","","","","","","","","","","","","","","","","","","","","","","","","",""]
[372,{"$nulls":9},{"$f":"IF(ISBLANK($B377),0,VLOOKUP($B377,FullDragonTable,2,0))","v":0},"","","","","","","","","","","","","","","","","","","","","","","","","","","",""]
[373,{"$nulls":9},{"$f":"IF(ISBLANK($B378),0,VLOOKUP($B378,FullDragonTable,2,0))","v":0},"","","","","","","","","","","","","","","","","","","","","","","","","","","",""]
[374,{"$nulls":9},{"$f":"IF(ISBLANK($B379),0,VLOOKUP($B379,FullDragonTable,2,0))","v":0},"","","","","","","","","","","","","","","","","","","","","","","","","","","",""]
[375,{"$nulls":9},{"$f":"IF(ISBLANK($B380),0,VLOOKUP($B380,FullDragonTable,2,0))","v":0},"","","","","","","","","","","","","","","","","","","","","","","","","","","",""]
[376,{"$nulls":9},{"$f":"IF(ISBLANK($B381),0,VLOOKUP($B381,FullDragonTable,2,0))","v":0},"","","","","","","","","","","","","","","","","","","","","","","","","","","",""]
[377,{"$nulls":9},{"$f":"IF(ISBLANK($B382),0,VLOOKUP($B382,FullDragonTable,2,0))","v":0},"","","","","","","","","","","","","","","","","","","","","","","","","","","",""]
[378,{"$nulls":9},{"$f":"IF(ISBLANK($B383),0,VLOOKUP($B383,FullDragonTable,2,0))","v":0},"","","","","","","","","","","","","","","","","","","","","","","","","","","",""]
[379,{"$nulls":9},{"$f":"IF(ISBLANK($B384),0,VLOOKUP($B384,FullDragonTable,2,0))","v":0},"","","","","","","","","","","","","","","","","","","","","","","","","","","",""]
[380,{"$nulls":9},{"$f":"IF(ISBLANK($B385),0,VLOOKUP($B385,FullDragonTable,2,0))","v":0},"","","","","","","","","","","","","","","","","","","","","","","","","","","",""]
[381,{"$nulls":9},{"$f":"IF(ISBLANK($B386),0,VLOOKUP($B386,FullDragonTable,2,0))","v":0},"","","","","","","","","","","","","","","","","","","","","","","","","","","",""]
[382,{"$nulls":9},{"$f":"IF(ISBLANK($B387),0,VLOOKUP($B387,FullDragonTable,2,0))","v":0},"","","","","","","","","","","","","","","","","","","","","","","","","","","",""]
[383,{"$nulls":9},{"$f":"IF(ISBLANK($B388),0,VLOOKUP($B388,FullDragonTable,2,0))","v":0},"","","","","","","","","","","","","","","","","","","","","","","","","","","",""]
[384,{"$nulls":9},{"$f":"IF(ISBLANK($B389),0,VLOOKUP($B389,FullDragonTable,2,0))","v":0},"","","","","","","","","","","","","","","","","","","","","","","","","","","",""]
[385,{"$nulls":9},{"$f":"IF(ISBLANK($B390),0,VLOOKUP($B390,FullDragonTable,2,0))","v":0},{"$f":"IF(ISBLANK($B390),\"\",IF(ISBLANK(VLOOKUP($B390,FullDragonTable,3,0)),\"\",VLOOKUP($B390,FullDragonTable,3,0)))","v":""},{"$f":"IF(ISBLANK($B390),\"\",IF(ISBLANK(VLOOKUP($B390,FullDragonTable,4,0)),\"\",VLOOKUP($B390,FullDragonTable,4,0)))","v":""},{"$f":"IF(ISBLANK($B390),\"\",IF(ISBLANK(VLOOKUP($B390,FullDragonTable,5,0)),\"\",VLOOKUP($B390,FullDragonTable,5,0)))","v":""},{"$f":"IF(ISBLANK($B390),\"\",IF(ISBLANK(VLOOKUP($B390,FullDragonTable,6,0)),\"\",VLOOKUP($B390,FullDragonTable,6,0)))","v":""},{"$f":"IF(ISBLANK($B390),\"\",VLOOKUP($B390,FullDragonTable,7,0))","v":""},{"$f":"IF(ISBLANK($B390),\"\",VLOOKUP(P390,AttackTable,2,0))","v":""},{"$f":"IF(ISBLANK($B390),\"\",VLOOKUP(P390,AttackTable,3,0))","v":""},{"$f":"IF(ISBLANK($B390),\"\",VLOOKUP($B390,FullDragonTable,8,0))","v":""},{"$f":"IF(ISBLANK($B390),\"\",VLOOKUP(S390,AttackTable,2,0))","v":""},{"$f":"IF(ISBLANK($B390),\"\",VLOOKUP(S390,AttackTable,3,0))","v":""},{"$f":"IF(ISBLANK($B390),\"\",VLOOKUP($B390,FullDragonTable,9,0))","v":""},{"$f":"IF(ISBLANK($B390),\"\",VLOOKUP(V390,AttackTable,2,0))","v":""},{"$f":"IF(ISBLANK($B390),\"\",VLOOKUP(V390,AttackTable,3,0))","v":""},{"$f":"IF(ISBLANK($B390),\"\",VLOOKUP($B390,FullDragonTable,10,0))","v":""},{"$f":"IF(ISBLANK($B390),\"\",VLOOKUP(Y390,AttackTable,2,0))","v":""},{"$f":"IF(ISBLANK($B390),\"\",VLOOKUP(Y390,AttackTable,3,0))","v":""},{"$f":"IF(ISBLANK($B390),\"\",VLOOKUP($B390,FullDragonTable,11,0))","v":""},{"$f":"IF(ISBLANK($B390),\"\",VLOOKUP(AB390,AttackTable,2,0))","v":""},{"$f":"IF(ISBLANK($B390),\"\",VLOOKUP(AB390,AttackTable,3,0))","v":""},{"$f":"IF(ISBLANK($B390),\"\",VLOOKUP($B390,FullDragonTable,12,0))","v":""},{"$f":"IF(ISBLANK($B390),\"\",VLOOKUP(AE390,AttackTable,2,0))","v":""},{"$f":"IF(ISBLANK($B390),\"\",VLOOKUP(AE390,AttackTable,3,0))","v":""},{"$f":"IF(ISBLANK($B390),\"\",VLOOKUP($B390,FullDragonTable,13,0))","v":""},{"$f":"IF(ISBLANK($B390),\"\",VLOOKUP(AH390,AttackTable,2,0))","v":""},{"$f":"IF(ISBLANK($B390),\"\",VLOOKUP(AH390,AttackTable,3,0))","v":""},{"$f":"IF(ISBLANK($B390),\"\",VLOOKUP($B390,FullDragonTable,14,0))","v":""},{"$f":"IF(ISBLANK($B390),\"\",VLOOKUP(AK390,AttackTable,2,0))","v":""},{"$f":"IF(ISBLANK($B390),\"\",VLOOKUP(AK390,AttackTable,3,0))","v":""}]
[386,{"$nulls":9},{"$f":"IF(ISBLANK($B391),0,VLOOKUP($B391,FullDragonTable,2,0))","v":0},"","","","","","","","","","","","","","","","","","","","","","","","","","","",""]
[387,{"$nulls":9},{"$f":"IF(ISBLANK($B392),0,VLOOKUP($B392,FullDragonTable,2,0))","v":0},"","","","","","","","","","","","","","","","","","","","","","","","","","","",""]
[388,{"$nulls":9},{"$f":"IF(ISBLANK($B393),0,VLOOKUP($B393,FullDragonTable,2,0))","v":0},"","","","","","","","","","","","","","","","","","","","","","","","","","","",""]
[389,{"$nulls":9},{"$f":"IF(ISBLANK($B394),0,VLOOKUP($B394,FullDragonTable,2,0))","v":0},"","","","","","","","","","","","","","","","","","","","","","","","","","","",""]
[390,{"$nulls":9},{"$f":"IF(ISBLANK($B395),0,VLOOKUP($B395,FullDragonTable,2,0))","v":0},"","","","","","","","","","","","","","","","","","","","","","","","","","","",""]
[391,{"$nulls":9},{"$f":"IF(ISBLANK($B396),0,VLOOKUP($B396,FullDragonTable,2,0))","v":0},"","","","","","","","","","","","","","","","","","","","","","","","","","","",""]
[392,{"$nulls":9},{"$f":"IF(ISBLANK($B397),0,VLOOKUP($B397,FullDragonTable,2,0))","v":0},"","","","","","","","","","","","","","","","","","","","","","","","","","","",""]
[393,{"$nulls":9},{"$f":"IF(ISBLANK($B398),0,VLOOKUP($B398,FullDragonTable,2,0))","v":0},"","","","","","","","","","","","","","","","","","","","","","","","","","","",""]
[394,{"$nulls":9},{"$f":"IF(ISBLANK($B399),0,VLOOKUP($B399,FullDragonTable,2,0))","v":0},"","","","","","","","","","","","","","","","","","","","","","","","","","","",""]
[395,{"$nulls":9},{"$f":"IF(ISBLANK($B400),0,VLOOKUP($B400,FullDragonTable,2,0))","v":0},"","","","","","","","","","","","","","","","","","","","","","","","","","","",""]
[396,{"$nulls":9},{"$f":"IF(ISBLANK($B401),0,VLOOKUP($B401,FullDragonTable,2,0))","v":0},"","","","","","","","","","","","","","","","","","","","","","","","","","","",""]
[397,{"$nulls":9},{"$f":"IF(ISBLANK($B402),0,VLOOKUP($B402,FullDragonTable,2,0))","v":0},"","","","","","","","","","","","","","","","","","","","","","","","","","","",""]
[398,{"$nulls":9},{"$f":"IF(ISBLANK($B403),0,VLOOKUP($B403,FullDragonTable,2,0))","v":0},"","","","","","","","","","","","","","","","","","","","","","","","","","","",""]
[399,{"$nulls":9},{"$f":"IF(ISBLANK($B404),0,VLOOKUP($B404,FullDragonTable,2,0))","v":0},"","","","","","","","","","","","","","","","","","","","","","","","","","","",""]
[400,{"$nulls":9},{"$f":"IF(ISBLANK($B405),0,VLOOKUP($B405,FullDragonTable,2,0))","v":0},"","","","","","","","","","","","","","","","","","","","","","","","","","","",""]
[401,{"$nulls":9},{"$f":"IF(ISBLANK($B406),0,VLOOKUP($B406,FullDragonTable,2,0))","v":0},"","","","","","","","","","","","","","","","","","","","","","","","","","","",""]
[402,{"$nulls":9},{"$f":"IF(ISBLANK($B407),0,VLOOKUP($B407,FullDragonTable,2,0))","v":0},"","","","","","","","","","","","","","","","","","","","","","","","","","","",""]
[403,{"$nulls":9},{"$f":"IF(ISBLANK($B408),0,VLOOKUP($B408,FullDragonTable,2,0))","v":0},"","","","","","","","","","","","","","","","","","","","","","","","","","","",""]
[404,{"$nulls":9},{"$f":"IF(ISBLANK($B409),0,VLOOKUP($B409,FullDragonTable,2,0))","v":0},"","","","","","","","","","","","","","","","","","","","","","","","","","","",""]
[405,{"$nulls":9},{"$f":"IF(ISBLANK($B410),0,VLOOKUP($B410,FullDragonTable,2,0))","v":0},"","","","","","","","","","","","","","","","","","","","","","","","","","","",""]
[406,{"$nulls":9},{"$f":"IF(ISBLANK($B411),0,VLOOKUP($B411,FullDragonTable,2,0))","v":0},"","","","","","","","","","","","","","","","","","","","","","","","","","","",""]
[407,{"$nulls":9},{"$f":"IF(ISBLANK($B412),0,VLOOKUP($B412,FullDragonTable,2,0))","v":0},"","","","","","","","","","","","","","","","","","","","","","","","","","","",""]
[408,{"$nulls":9},{"$f":"IF(ISBLANK($B413),0,VLOOKUP($B413,FullDragonTable,2,0))","v":0},"","","","","","","","","","","","","","","","","","","","","","","","","","","",""]
[409,{"$nulls":9},{"$f":"IF(ISBLANK($B414),0,VLOOKUP($B414,FullDragonTable,2,0))","v":0},"","","","","","","","","","","","","","","","","","","","","","","","","","","",""]
[410,{"$nulls":9},{"$f":"IF(ISBLANK($B415),0,VLOOKUP($B415,FullDragonTable,2,0))","v":0},"","","","","","","","","","","","","","","","","","","","","","","","","","","",""]
[411,{"$nulls":9},{"$f":"IF(ISBLANK($B416),0,VLOOKUP($B416,FullDragonTable,2,0))","v":0},"","","","","","","","","","","","","","","","","","","","","","","","","","","",""]
[412,{"$nulls":9},{"$f":"IF(ISBLANK($B417),0,VLOOKUP($B417,FullDragonTable,2,0))","v":0},"","","","","","","","","","","","","","","","","","","","","","","","","","","",""]
[413,{"$nulls":9},{"$f":"IF(ISBLANK($B418),0,VLOOKUP($B418,FullDragonTable,2,0))","v":0},"","","","","","","","","","","","","","","","","","","","","","","","","","","",""]
[414,{"$nulls":9},{"$f":"IF(ISBLANK($B419),0,VLOOKUP($B419,FullDragonTable,2,0))","v":0},"","","","","","","","","","","","","","","","","","","","","","","","","","","",""]
[415,{"$nulls":9},{"$f":"IF(ISBLANK($B420),0,VLOOKUP($B420,FullDragonTable,2,0))","v":0},"","","","","","","","","","","","","","","","","","","","","","","","","","","",""]
[416,{"$nulls":9},{"$f":"IF(ISBLANK($B421),0,VLOOKUP($B421,FullDragonTable,2,0))","v":0},"","","","","","","","","","","","","","","","","","","","","","","","","","","",""]
[417,{"$nulls":9},{"$f":"IF(ISBLANK($B422),0,VLOOKUP($B422,FullDragonTable,2,0))","v":0},"","","","","","","","","","","","","","","","","","","","","","","","","","","",""]
[418,{"$nulls":9},{"$f":"IF(ISBLANK($B423),0,VLOOKUP($B423,FullDragonTable,2,0))","v":0},"","","","","","","","","","","","","","","","","","","","","","","","","","","",""]
[419,{"$nulls":9},{"$f":"IF(ISBLANK($B424),0,VLOOKUP($B424,FullDragonTable,2,0))","v":0},"","","","","","","","","","","","","","","","","","","","","","","","","","","",""]
[420,{"$nulls":9},{"$f":"IF(ISBLANK($B425),0,VLOOKUP($B425,FullDragonTable,2,0))","v":0},"","","","","","","","","","","","","","","","","","","","","","","","","","","",""]
[421,{"$nulls":9},{"$f":"IF(ISBLANK($B426),0,VLOOKUP($B426,FullDragonTable,2,0))","v":0},"","","","","","","","","","","","","","","","","","","","","","","","","","","",""]
[422,{"$nulls":9},{"$f":"IF(ISBLANK($B427),0,VLOOKUP($B427,FullDragonTable,2,0))","v":0},"","","","","","","","","","","","","","","","","","","","","","","","","","","",""]
[423,{"$nulls":9},{"$f":"IF(ISBLANK($B428),0,VLOOKUP($B428,FullDragonTable,2,0))","v":0},"","","","","","","","","","","","","","","","","","","","","","","","","","","",""]
[424,{"$nulls":9},{"$f":"IF(ISBLANK($B429),0,VLOOKUP($B429,FullDragonTable,2,0))","v":0},"","","","","","","","","","","","","","","","","","","","","","","","","","","",""]
[425,{"$nulls":9},{"$f":"IF(ISBLANK($B430),0,VLOOKUP($B430,FullDragonTable,2,0))","v":0},"","","","","","","","","","","","","","","","","","","","","","","","","","","",""]
[426,{"$nulls":9},{"$f":"IF(ISBLANK($B431),0,VLOOKUP($B431,FullDragonTable,2,0))","v":0},"","","","","","","","","","","","","","","","","","","","","","","","","","","",""]
[427,{"$nulls":9},{"$f":"IF(ISBLANK($B432),0,VLOOKUP($B432,FullDragonTable,2,0))","v":0},"","","","","","","","","","","","","","","","","","","","","","","","","","","",""]
[428,{"$nulls":9},{"$f":"IF(ISBLANK($B433),0,VLOOKUP($B433,FullDragonTable,2,0))","v":0},"","","","","","","","","","","","","","","","","","","","","","","","","","","",""]
[429,{"$nulls":9},{"$f":"IF(ISBLANK($B434),0,VLOOKUP($B434,FullDragonTable,2,0))","v":0},"","","","","","","","","","","","","","","","","","","","","","","","","","","",""]
[430,{"$nulls":9},{"$f":"IF(ISBLANK($B435),0,VLOOKUP($B435,FullDragonTable,2,0))","v":0},"","","","","","","","","","","","","","","","","","","","","","","","","","","",""]
[431,{"$nulls":9},{"$f":"IF(ISBLANK($B436),0,VLOOKUP($B436,FullDragonTable,2,0))","v":0},"","","","","","","","","","","","","","","","","","","","","","","","","","","",""]
[432,{"$nulls":9},{"$f":"IF(ISBLANK($B437),0,VLOOKUP($B437,FullDragonTable,2,0))","v":0},"","","","","","","","","","","","","","","","","","","","","","","","","","","",""]
[433,{"$nulls":9},{"$f":"IF(ISBLANK($B438),0,VLOOKUP($B438,FullDragonTable,2,0))","v":0},"","","","","","","","","","","","","","","","","","","","","","","","","","","",""]
[434,{"$nulls":9},{"$f":"IF(ISBLANK($B439),0,VLOOKUP($B439,FullDragonTable,2,0))","v":0},"","","","","","","","","","","","","","","","","","","","","","","","","","","",""]
[435,{"$nulls":9},{"$f":"IF(ISBLANK($B440),0,VLOOKUP($B440,FullDragonTable,2,0))","v":0},"","","","","","","","","","","","","","","","","","","","","","","","","","","",""]
[436,{"$nulls":9},{"$f":"IF(ISBLANK($B441),0,VLOOKUP($B441,FullDragonTable,2,0))","v":0},"","","","","","","","","","","","","","","","","","","","","","","","","","","",""]
[437,{"$nulls":9},{"$f":"IF(ISBLANK($B442),0,VLOOKUP($B442,FullDragonTable,2,0))","v":0},"","","","","","","","","","","","","","","","","","","","","","","","","","","",""]
[438,{"$nulls":9},{"$f":"IF(ISBLANK($B443),0,VLOOKUP($B443,FullDragonTable,2,0))","v":0},"","","","","","","","","","","","","","","","","","","","","","","","","","","",""]
[439,{"$nulls":9},{"$f":"IF(ISBLANK($B444),0,VLOOKUP($B444,FullDragonTable,2,0))","v":0},"","","","","","","","","","","","","","","","","","","","","","","","","","","",""]
[440,{"$nulls":9},{"$f":"IF(ISBLANK($B445),0,VLOOKUP($B445,FullDragonTable,2,0))","v":0},"","","","","","","","","","","","","","","","","","","","","","","","","","","",""]
[441,{"$nulls":9},{"$f":"IF(ISBLANK($B446),0,VLOOKUP($B446,FullDragonTable,2,0))","v":0},"","","","","","","","","","","","","","","","","","","","","","","","","","","",""]
[442,{"$nulls":9},{"$f":"IF(ISBLANK($B447),0,VLOOKUP($B447,FullDragonTable,2,0))","v":0},"","","","","","","","","","","","","","","","","","","","","","","","","","","",""]
[443,{"$nulls":9},{"$f":"IF(ISBLANK($B448),0,VLOOKUP($B448,FullDragonTable,2,0))","v":0},"","","","","","","","","","","","","","","","","","","","","","","","","","","",""]
[444,{"$nulls":9},{"$f":"IF(ISBLANK($B449),0,VLOOKUP($B449,FullDragonTable,2,0))","v":0},"","","","","","","","","","","","","","","","","","","","","","","","","","","",""]
[445,{"$nulls":9},{"$f":"IF(ISBLANK($B450),0,VLOOKUP($B450,FullDragonTable,2,0))","v":0},"","","","","","","","","","","","","","","","","","","","","","","","","","","",""]
[446,{"$nulls":9},{"$f":"IF(ISBLANK($B451),0,VLOOKUP($B451,FullDragonTable,2,0))","v":0},"","","","","","","","","","","","","","","","","","","","","","","","","","","",""]
[447,{"$nulls":9},{"$f":"IF(ISBLANK($B452),0,VLOOKUP($B452,FullDragonTable,2,0))","v":0},"","","","","","","","","","","","","","","","","","","","","","","","","","","",""]
[448,{"$nulls":9},{"$f":"IF(ISBLANK($B453),0,VLOOKUP($B453,FullDragonTable,2,0))","v":0},"","","","","","","","","","","","","","","","","","","","","","","","","","","",""]
[449,{"$nulls":9},{"$f":"IF(ISBLANK($B454),0,VLOOKUP($B454,FullDragonTable,2,0))","v":0},{"$f":"IF(ISBLANK($B454),\"\",IF(ISBLANK(VLOOKUP($B454,FullDragonTable,3,0)),\"\",VLOOKUP($B454,FullDragonTable,3,0)))","v":""},{"$f":"IF(ISBLANK($B454),\"\",IF(ISBLANK(VLOOKUP($B454,FullDragonTable,4,0)),\"\",VLOOKUP($B454,FullDragonTable,4,0)))","v":""},{"$f":"IF(ISBLANK($B454),\"\",IF(ISBLANK(VLOOKUP($B454,FullDragonTable,5,0)),\"\",VLOOKUP($B454,FullDragonTable,5,0)))","v":""},{"$f":"IF(ISBLANK($B454),\"\",IF(ISBLANK(VLOOKUP($B454,FullDragonTable,6,0)),\"\",VLOOKUP($B454,FullDragonTable,6,0)))","v":""},{"$f":"IF(ISBLANK($B454),\"\",VLOOKUP($B454,FullDragonTable,7,0))","v":""},{"$f":"IF(ISBLANK($B454),\"\",VLOOKUP(P454,AttackTable,2,0))","v":""},{"$f":"IF(ISBLANK($B454),\"\",VLOOKUP(P454,AttackTable,3,0))","v":""},{"$f":"IF(ISBLANK($B454),\"\",VLOOKUP($B454,FullDragonTable,8,0))","v":""},{"$f":"IF(ISBLANK($B454),\"\",VLOOKUP(S454,AttackTable,2,0))","v":""},{"$f":"IF(ISBLANK($B454),\"\",VLOOKUP(S454,AttackTable,3,0))","v":""},{"$f":"IF(ISBLANK($B454),\"\",VLOOKUP($B454,FullDragonTable,9,0))","v":""},{"$f":"IF(ISBLANK($B454),\"\",VLOOKUP(V454,AttackTable,2,0))","v":""},{"$f":"IF(ISBLANK($B454),\"\",VLOOKUP(V454,AttackTable,3,0))","v":""},{"$f":"IF(ISBLANK($B454),\"\",VLOOKUP($B454,FullDragonTable,10,0))","v":""},{"$f":"IF(ISBLANK($B454),\"\",VLOOKUP(Y454,AttackTable,2,0))","v":""},{"$f":"IF(ISBLANK($B454),\"\",VLOOKUP(Y454,AttackTable,3,0))","v":""},{"$f":"IF(ISBLANK($B454),\"\",VLOOKUP($B454,FullDragonTable,11,0))","v":""},{"$f":"IF(ISBLANK($B454),\"\",VLOOKUP(AB454,AttackTable,2,0))","v":""},{"$f":"IF(ISBLANK($B454),\"\",VLOOKUP(AB454,AttackTable,3,0))","v":""},{"$f":"IF(ISBLANK($B454),\"\",VLOOKUP($B454,FullDragonTable,12,0))","v":""},{"$f":"IF(ISBLANK($B454),\"\",VLOOKUP(AE454,AttackTable,2,0))","v":""},{"$f":"IF(ISBLANK($B454),\"\",VLOOKUP(AE454,AttackTable,3,0))","v":""},{"$f":"IF(ISBLANK($B454),\"\",VLOOKUP($B454,FullDragonTable,13,0))","v":""},{"$f":"IF(ISBLANK($B454),\"\",VLOOKUP(AH454,AttackTable,2,0))","v":""},{"$f":"IF(ISBLANK($B454),\"\",VLOOKUP(AH454,AttackTable,3,0))","v":""},{"$f":"IF(ISBLANK($B454),\"\",VLOOKUP($B454,FullDragonTable,14,0))","v":""},{"$f":"IF(ISBLANK($B454),\"\",VLOOKUP(AK454,AttackTable,2,0))","v":""},{"$f":"IF(ISBLANK($B454),\"\",VLOOKUP(AK454,AttackTable,3,0))","v":""}]
[450,{"$nulls":9},{"$f":"IF(ISBLANK($B455),0,VLOOKUP($B455,FullDragonTable,2,0))","v":0},"","","","","","","","","","","","","","","","","","","","","","","","","","","",""]
[451,{"$nulls":9},{"$f":"IF(ISBLANK($B456),0,VLOOKUP($B456,FullDragonTable,2,0))","v":0},"","","","","","","","","","","","","","","","","","","","","","","","","","","",""]
[452,{"$nulls":9},{"$f":"IF(ISBLANK($B457),0,VLOOKUP($B457,FullDragonTable,2,0))","v":0},"","","","","","","","","","","","","","","","","","","","","","","","","","","",""]
[453,{"$nulls":9},{"$f":"IF(ISBLANK($B458),0,VLOOKUP($B458,FullDragonTable,2,0))","v":0},"","","","","","","","","","","","","","","","","","","","","","","","","","","",""]
[454,{"$nulls":9},{"$f":"IF(ISBLANK($B459),0,VLOOKUP($B459,FullDragonTable,2,0))","v":0},"","","","","","","","","","","","","","","","","","","","","","","","","","","",""]
[455,{"$nulls":9},{"$f":"IF(ISBLANK($B460),0,VLOOKUP($B460,FullDragonTable,2,0))","v":0},"","","","","","","","","","","","","","","","","","","","","","","","","","","",""]
[456,{"$nulls":9},{"$f":"IF(ISBLANK($B461),0,VLOOKUP($B461,FullDragonTable,2,0))","v":0},"","","","","","","","","","","","","","","","","","","","","","","","","","","",""]
[457,{"$nulls":9},{"$f":"IF(ISBLANK($B462),0,VLOOKUP($B462,FullDragonTable,2,0))","v":0},"","","","","","","","","","","","","","","","","","","","","","","","","","","",""]
[458,{"$nulls":9},{"$f":"IF(ISBLANK($B463),0,VLOOKUP($B463,FullDragonTable,2,0))","v":0},"","","","","","","","","","","","","","","","","","","","","","","","","","","",""]
[459,{"$nulls":9},{"$f":"IF(ISBLANK($B464),0,VLOOKUP($B464,FullDragonTable,2,0))","v":0},"","","","","","","","","","","","","","","","","","","","","","","","","","","",""]
[460,{"$nulls":9},{"$f":"IF(ISBLANK($B465),0,VLOOKUP($B465,FullDragonTable,2,0))","v":0},"","","","","","","","","","","","","","","","","","","","","","","","","","","",""]
[461,{"$nulls":9},{"$f":"IF(ISBLANK($B466),0,VLOOKUP($B466,FullDragonTable,2,0))","v":0},"","","","","","","","","","","","","","","","","","","","","","","","","","","",""]
[462,{"$nulls":9},{"$f":"IF(ISBLANK($B467),0,VLOOKUP($B467,FullDragonTable,2,0))","v":0},"","","","","","","","","","","","","","","","","","","","","","","","","","","",""]
[463,{"$nulls":9},{"$f":"IF(ISBLANK($B468),0,VLOOKUP($B468,FullDragonTable,2,0))","v":0},"","","","","","","","","","","","","","","","","","","","","","","","","","","",""]
[464,{"$nulls":9},{"$f":"IF(ISBLANK($B469),0,VLOOKUP($B469,FullDragonTable,2,0))","v":0},"","","","","","","","","","","","","","","","","","","","","","","","","","","",""]
[465,{"$nulls":9},{"$f":"IF(ISBLANK($B470),0,VLOOKUP($B470,FullDragonTable,2,0))","v":0},"","","","","","","","","","","","","","","","","","","","","","","","","","","",""]
[466,{"$nulls":9},{"$f":"IF(ISBLANK($B471),0,VLOOKUP($B471,FullDragonTable,2,0))","v":0},"","","","","","","","","","","","","","","","","","","","","","","","","","","",""]
[467,{"$nulls":9},{"$f":"IF(ISBLANK($B472),0,VLOOKUP($B472,FullDragonTable,2,0))","v":0},"","","","","","","","","","","","","","","","","","","","","","","","","","","",""]
[468,{"$nulls":9},{"$f":"IF(ISBLANK($B473),0,VLOOKUP($B473,FullDragonTable,2,0))","v":0},"","","","","","","","","","","","","","","","","","","","","","","","","","","",""]
[469,{"$nulls":9},{"$f":"IF(ISBLANK($B474),0,VLOOKUP($B474,FullDragonTable,2,0))","v":0},"","","","","","","","","","","","","","","","","","","","","","","","","","","",""]
[470,{"$nulls":9},{"$f":"IF(ISBLANK($B475),0,VLOOKUP($B475,FullDragonTable,2,0))","v":0},"","","","","","","","","","","","","","","","","","","","","","","","","","","",""]
[471,{"$nulls":9},{"$f":"IF(ISBLANK($B476),0,VLOOKUP($B476,FullDragonTable,2,0))","v":0},"","","","","","","","","","","","","","","","","","","","","","","","","","","",""]
[472,{"$nulls":9},{"$f":"IF(ISBLANK($B477),0,VLOOKUP($B477,FullDragonTable,2,0))","v":0},"","","","","","","","","","","","","","","","","","","","","","","","","","","",""]
[473,{"$nulls":9},{"$f":"IF(ISBLANK($B478),0,VLOOKUP($B478,FullDragonTable,2,0))","v":0},"","","",null,"","","","","","","","","","","","","","","","","","","","","","","",""]
[474,{"$nulls":9},{"$f":"IF(ISBLANK($B479),0,VLOOKUP($B479,FullDragonTable,2,0))","v":0},"","","",{"$f":"IF(ISBLANK($B479),\"\",IF(ISBLANK(VLOOKUP($B479,FullDragonTable,6,0)),\"\",VLOOKUP($B479,FullDragonTable,6,0)))","v":""},"","","","","","","","","","","","","","","","","","","","","","","",""]
[475,{"$nulls":9},{"$f":"IF(ISBLANK($B480),0,VLOOKUP($B480,FullDragonTable,2,0))","v":0},"","","","","","","","","","","","","","","","","","","","","","","","","","","",""]
[476,{"$nulls":9},{"$f":"IF(ISBLANK($B481),0,VLOOKUP($B481,FullDragonTable,2,0))","v":0},"","","","","","","","","","","","","","","","","","","","","","","","","","","",""]
[477,{"$nulls":9},{"$f":"IF(ISBLANK($B482),0,VLOOKUP($B482,FullDragonTable,2,0))","v":0},"","","","","","","","","","","","","","","","","","","","","","","","","","","",""]
[478,{"$nulls":9},{"$f":"IF(ISBLANK($B483),0,VLOOKUP($B483,FullDragonTable,2,0))","v":0},"","","","","","","","","","","","","","","","","","","","","","","","","","","",""]
[479,{"$nulls":9},{"$f":"IF(ISBLANK($B484),0,VLOOKUP($B484,FullDragonTable,2,0))","v":0},"","","","","","","","","","","","","","","","","","","","","","","","","","","",""]
[480,{"$nulls":9},{"$f":"IF(ISBLANK($B485),0,VLOOKUP($B485,FullDragonTable,2,0))","v":0},"","","","","","","","","","","","","","","","","","","","","","","","","","","",""]
[481,{"$nulls":9},{"$f":"IF(ISBLANK($B486),0,VLOOKUP($B486,FullDragonTable,2,0))","v":0},"","","","","","","","","","","","","","","","","","","","","","","","","","","",""]
[482,{"$nulls":9},{"$f":"IF(ISBLANK($B487),0,VLOOKUP($B487,FullDragonTable,2,0))","v":0},"","","","","","","","","","","","","","","","","","","","","","","","","","","",""]
[483,{"$nulls":9},{"$f":"IF(ISBLANK($B488),0,VLOOKUP($B488,FullDragonTable,2,0))","v":0},"","","","","","","","","","","","","","","","","","","","","","","","","","","",""]
[484,{"$nulls":9},{"$f":"IF(ISBLANK($B489),0,VLOOKUP($B489,FullDragonTable,2,0))","v":0},"","","","","","","","","","","","","","","","","","","","","","","","","","","",""]
[485,{"$nulls":9},{"$f":"IF(ISBLANK($B490),0,VLOOKUP($B490,FullDragonTable,2,0))","v":0},"","","","","","","","","","","","","","","","","","","","","","","","","","","",""]
[486,{"$nulls":9},{"$f":"IF(ISBLANK($B491),0,VLOOKUP($B491,FullDragonTable,2,0))","v":0},"","","","","","","","","","","","","","","","","","","","","","","","","","","",""]
[487,{"$nulls":9},{"$f":"IF(ISBLANK($B492),0,VLOOKUP($B492,FullDragonTable,2,0))","v":0},"","","","","","","","","","","","","","","","","","","","","","","","","","","",""]
[488,{"$nulls":9},{"$f":"IF(ISBLANK($B493),0,VLOOKUP($B493,FullDragonTable,2,0))","v":0},"","","","","","","","","","","","","","","","","","","","","","","","","","","",""]
[489,{"$nulls":9},{"$f":"IF(ISBLANK($B494),0,VLOOKUP($B494,FullDragonTable,2,0))","v":0},"","","","","","","","","","","","","","","","","","","","","","","","","","","",""]
[490,{"$nulls":9},{"$f":"IF(ISBLANK($B495),0,VLOOKUP($B495,FullDragonTable,2,0))","v":0},"","","","","","","","","","","","","","","","","","","","","","","","","","","",""]
[491,{"$nulls":9},{"$f":"IF(ISBLANK($B496),0,VLOOKUP($B496,FullDragonTable,2,0))","v":0},"","","","","","","","","","","","","","","","","","","","","","","","","","","",""]
[492,{"$nulls":9},{"$f":"IF(ISBLANK($B497),0,VLOOKUP($B497,FullDragonTable,2,0))","v":0},"","","","","","","","","","","","","","","","","","","","","","","","","","","",""]
[493,{"$nulls":9},{"$f":"IF(ISBLANK($B498),0,VLOOKUP($B498,FullDragonTable,2,0))","v":0},"","","","","","","","","","","","","","","","","","","","","","","","","","","",""]
[494,{"$nulls":9},{"$f":"IF(ISBLANK($B499),0,VLOOKUP($B499,FullDragonTable,2,0))","v":0},"","","","","","","","","","","","","","","","","","","","","","","","","","","",""]
[495,{"$nulls":9},{"$f":"IF(ISBLANK($B500),0,VLOOKUP($B500,FullDragonTable,2,0))","v":0},"","","","","","","","","","","","","","","","","","","","","","","","","","","",""]
[496,{"$nulls":9},{"$f":"IF(ISBLANK($B501),0,VLOOKUP($B501,FullDragonTable,2,0))","v":0},"","","","","","","","","","","","","","","","","","","","","","","","","","","",""]
[497,{"$nulls":9},{"$f":"IF(ISBLANK($B502),0,VLOOKUP($B502,FullDragonTable,2,0))","v":0},"","","","","","","","","","","","","","","","","","","","","","","","","","","",""]
[498,{"$nulls":9},{"$f":"IF(ISBLANK($B503),0,VLOOKUP($B503,FullDragonTable,2,0))","v":0},"","","","","","","","","","","","","","","","","","","","","","","","","","","",""]
[499,{"$nulls":9},{"$f":"IF(ISBLANK($B504),0,VLOOKUP($B504,FullDragonTable,2,0))","v":0},"","","","","","","","","","","","","","","","","","","","","","","","","","","",""]
[500,{"$nulls":9},{"$f":"IF(ISBLANK($B505),0,VLOOKUP($B505,FullDragonTable,2,0))","v":0},"","","","","","","","","","","","","","","","","","","","","","","","","","","",""]
[501,{"$nulls":9},{"$f":"IF(ISBLANK($B506),0,VLOOKUP($B506,FullDragonTable,2,0))","v":0},"","","","","","","","","","","","","","","","","","","","","","","","","","","",""]
[502,{"$nulls":9},{"$f":"IF(ISBLANK($B507),0,VLOOKUP($B507,FullDragonTable,2,0))","v":0},"","","","","","","","","","","","","","","","","","","","","","","","","","","",""]
[503,{"$nulls":9},{"$f":"IF(ISBLANK($B508),0,VLOOKUP($B508,FullDragonTable,2,0))","v":0},"","","","","","","","","","","","","","","","","","","","","","","","","","","",""]
[504,{"$nulls":9},{"$f":"IF(ISBLANK($B509),0,VLOOKUP($B509,FullDragonTable,2,0))","v":0},"","","","","","","","","","","","","","","","","","","","","","","","","","","",""]
[505,{"$nulls":9},{"$f":"IF(ISBLANK($B510),0,VLOOKUP($B510,FullDragonTable,2,0))","v":0},"","","","","","","","","","","","","","","","","","","","","","","","","","","",""]
[506,{"$nulls":9},{"$f":"IF(ISBLANK($B511),0,VLOOKUP($B511,FullDragonTable,2,0))","v":0},"","","","","","","","","","","","","","","","","","","","","","","","","","","",""]
[507,{"$nulls":9},{"$f":"IF(ISBLANK($B512),0,VLOOKUP($B512,FullDragonTable,2,0))","v":0},"","","","","","","","","","","","","","","","","","","","","","","","","","","",""]
[508,{"$nulls":9},{"$f":"IF(ISBLANK($B513),0,VLOOKUP($B513,FullDragonTable,2,0))","v":0},"","","","","","","","","","","","","","","","","","","","","","","","","","","",""]
[509,{"$nulls":9},{"$f":"IF(ISBLANK($B514),0,VLOOKUP($B514,FullDragonTable,2,0))","v":0},"","","","","","","","","","","","","","","","","","","","","","","","","","","",""]
[510,{"$nulls":9},{"$f":"IF(ISBLANK($B515),0,VLOOKUP($B515,FullDragonTable,2,0))","v":0},"","","","","","","","","","","","","","","","","","","","","","","","","","","",""]
[511,{"$nulls":9},{"$f":"IF(ISBLANK($B516),0,VLOOKUP($B516,FullDragonTable,2,0))","v":0},"","","","","","","","","","","","","","","","","","","","","","","","","","","",""]
[512,{"$nulls":9},{"$f":"IF(ISBLANK($B517),0,VLOOKUP($B517,FullDragonTable,2,0))","v":0},"","","","","","","","","","","","","","","","","","","","","","","","","","","",""]
[513,{"$nulls":9},{"$f":"IF(ISBLANK($B518),0,VLOOKUP($B518,FullDragonTable,2,0))","v":0},{"$f":"IF(ISBLANK($B518),\"\",IF(ISBLANK(VLOOKUP($B518,FullDragonTable,3,0)),\"\",VLOOKUP($B518,FullDragonTable,3,0)))","v":""},{"$f":"IF(ISBLANK($B518),\"\",IF(ISBLANK(VLOOKUP($B518,FullDragonTable,4,0)),\"\",VLOOKUP($B518,FullDragonTable,4,0)))","v":""},{"$f":"IF(ISBLANK($B518),\"\",IF(ISBLANK(VLOOKUP($B518,FullDragonTable,5,0)),\"\",VLOOKUP($B518,FullDragonTable,5,0)))","v":""},"",{"$f":"IF(ISBLANK($B518),\"\",VLOOKUP($B518,FullDragonTable,7,0))","v":""},{"$f":"IF(ISBLANK($B518),\"\",VLOOKUP(P518,AttackTable,2,0))","v":""},{"$f":"IF(ISBLANK($B518),\"\",VLOOKUP(P518,AttackTable,3,0))","v":""},{"$f":"IF(ISBLANK($B518),\"\",VLOOKUP($B518,FullDragonTable,8,0))","v":""},{"$f":"IF(ISBLANK($B518),\"\",VLOOKUP(S518,AttackTable,2,0))","v":""},{"$f":"IF(ISBLANK($B518),\"\",VLOOKUP(S518,AttackTable,3,0))","v":""},{"$f":"IF(ISBLANK($B518),\"\",VLOOKUP($B518,FullDragonTable,9,0))","v":""},{"$f":"IF(ISBLANK($B518),\"\",VLOOKUP(V518,AttackTable,2,0))","v":""},{"$f":"IF(ISBLANK($B518),\"\",VLOOKUP(V518,AttackTable,3,0))","v":""},{"$f":"IF(ISBLANK($B518),\"\",VLOOKUP($B518,FullDragonTable,10,0))","v":""},{"$f":"IF(ISBLANK($B518),\"\",VLOOKUP(Y518,AttackTable,2,0))","v":""},{"$f":"IF(ISBLANK($B518),\"\",VLOOKUP(Y518,AttackTable,3,0))","v":""},{"$f":"IF(ISBLANK($B518),\"\",VLOOKUP($B518,FullDragonTable,11,0))","v":""},{"$f":"IF(ISBLANK($B518),\"\",VLOOKUP(AB518,AttackTable,2,0))","v":""},{"$f":"IF(ISBLANK($B518),\"\",VLOOKUP(AB518,AttackTable,3,0))","v":""},{"$f":"IF(ISBLANK($B518),\"\",VLOOKUP($B518,FullDragonTable,12,0))","v":""},{"$f":"IF(ISBLANK($B518),\"\",VLOOKUP(AE518,AttackTable,2,0))","v":""},{"$f":"IF(ISBLANK($B518),\"\",VLOOKUP(AE518,AttackTable,3,0))","v":""},{"$f":"IF(ISBLANK($B518),\"\",VLOOKUP($B518,FullDragonTable,13,0))","v":""},{"$f":"IF(ISBLANK($B518),\"\",VLOOKUP(AH518,AttackTable,2,0))","v":""},{"$f":"IF(ISBLANK($B518),\"\",VLOOKUP(AH518,AttackTable,3,0))","v":""},{"$f":"IF(ISBLANK($B518),\"\",VLOOKUP($B518,FullDragonTable,14,0))","v":""},{"$f":"IF(ISBLANK($B518),\"\",VLOOKUP(AK518,AttackTable,2,0))","v":""},{"$f":"IF(ISBLANK($B518),\"\",VLOOKUP(AK518,AttackTable,3,0))","v":""}]
[514,{"$nulls":9},{"$f":"IF(ISBLANK($B519),0,VLOOKUP($B519,FullDragonTable,2,0))","v":0},"","","","","","","","","","","","","","","","","","","","","","","","","","","",""]
[515,{"$nulls":9},{"$f":"IF(ISBLANK($B520),0,VLOOKUP($B520,FullDragonTable,2,0))","v":0},"","","","","","","","","","","","","","","","","","","","","","","","","","","",""]
[516,{"$nulls":9},{"$f":"IF(ISBLANK($B521),0,VLOOKUP($B521,FullDragonTable,2,0))","v":0},"","","","","","","","","","","","","","","","","","","","","","","","","","","",""]
[517,{"$nulls":9},{"$f":"IF(ISBLANK($B522),0,VLOOKUP($B522,FullDragonTable,2,0))","v":0},"","","","","","","","","","","","","","","","","","","","","","","","","","","",""]
[518,{"$nulls":9},{"$f":"IF(ISBLANK($B523),0,VLOOKUP($B523,FullDragonTable,2,0))","v":0},"","","","","","","","","","","","","","","","","","","","","","","","","","","",""]
[519,{"$nulls":9},{"$f":"IF(ISBLANK($B524),0,VLOOKUP($B524,FullDragonTable,2,0))","v":0},"","","","","","","","","","","","","","","","","","","","","","","","","","","",""]
[520,{"$nulls":9},{"$f":"IF(ISBLANK($B525),0,VLOOKUP($B525,FullDragonTable,2,0))","v":0},"","","","","","","","","","","","","","","","","","","","","","","","","","","",""]
[521,{"$nulls":9},{"$f":"IF(ISBLANK($B526),0,VLOOKUP($B526,FullDragonTable,2,0))","v":0},"","","","","","","","","","","","","","","","","","","","","","","","","","","",""]
[522,{"$nulls":9},{"$f":"IF(ISBLANK($B527),0,VLOOKUP($B527,FullDragonTable,2,0))","v":0},"","","","","","","","","","","","","","","","","","","","","","","","","","","",""]
[523,{"$nulls":9},{"$f":"IF(ISBLANK($B528),0,VLOOKUP($B528,FullDragonTable,2,0))","v":0},"","","","","","","","","","","","","","","","","","","","","","","","","","","",""]
[524,{"$nulls":9},{"$f":"IF(ISBLANK($B529),0,VLOOKUP($B529,FullDragonTable,2,0))","v":0},"","","","","","","","","","","","","","","","","","","","","","","","","","","",""]
[525,{"$nulls":9},{"$f":"IF(ISBLANK($B530),0,VLOOKUP($B530,FullDragonTable,2,0))","v":0},"","","","","","","","","","","","","","","","","","","","","","","","","","","",""]
[526,{"$nulls":9},{"$f":"IF(ISBLANK($B531),0,VLOOKUP($B531,FullDragonTable,2,0))","v":0},"","","","","","","","","","","","","","","","","","","","","","","","","","","",""]
[527,{"$nulls":9},{"$f":"IF(ISBLANK($B532),0,VLOOKUP($B532,FullDragonTable,2,0))","v":0},"","","","","","","","","","","","","","","","","","","","","","","","","","","",""]
[528,{"$nulls":9},{"$f":"IF(ISBLANK($B533),0,VLOOKUP($B533,FullDragonTable,2,0))","v":0},"","","","","","","","","","","","","","","","","","","","","","","","","","","",""]
[529,{"$nulls":9},{"$f":"IF(ISBLANK($B534),0,VLOOKUP($B534,FullDragonTable,2,0))","v":0},"","","","","","","","","","","","","","","","","","","","","","","","","","","",""]
[530,{"$nulls":9},{"$f":"IF(ISBLANK($B535),0,VLOOKUP($B535,FullDragonTable,2,0))","v":0},"","","","","","","","","","","","","","","","","","","","","","","","","","","",""]
[531,{"$nulls":9},{"$f":"IF(ISBLANK($B536),0,VLOOKUP($B536,FullDragonTable,2,0))","v":0},"","","","","","","","","","","","","","","","","","","","","","","","","","","",""]
[532,{"$nulls":9},{"$f":"IF(ISBLANK($B537),0,VLOOKUP($B537,FullDragonTable,2,0))","v":0},"","","","","","","","","","","","","","","","","","","","","","","","","","","",""]
[533,{"$nulls":9},{"$f":"IF(ISBLANK($B538),0,VLOOKUP($B538,FullDragonTable,2,0))","v":0},"","","","","","","","","","","","","","","","","","","","","","","","","","","",""]
[534,{"$nulls":9},{"$f":"IF(ISBLANK($B539),0,VLOOKUP($B539,FullDragonTable,2,0))","v":0},"","","","","","","","","","","","","","","","","","","","","","","","","","","",""]
[535,{"$nulls":9},{"$f":"IF(ISBLANK($B540),0,VLOOKUP($B540,FullDragonTable,2,0))","v":0},"","","","","","","","","","","","","","","","","","","","","","","","","","","",""]
[536,{"$nulls":9},{"$f":"IF(ISBLANK($B541),0,VLOOKUP($B541,FullDragonTable,2,0))","v":0},"","","","","","","","","","","","","","","","","","","","","","","","","","","",""]
[537,{"$nulls":9},{"$f":"IF(ISBLANK($B542),0,VLOOKUP($B542,FullDragonTable,2,0))","v":0},"","","","","","","","","","","","","","","","","","","","","","","","","","","",""]
[538,{"$nulls":9},{"$f":"IF(ISBLANK($B543),0,VLOOKUP($B543,FullDragonTable,2,0))","v":0},"","","",{"$f":"IF(ISBLANK($B543),\"\",IF(ISBLANK(VLOOKUP($B543,FullDragonTable,6,0)),\"\",VLOOKUP($B543,FullDragonTable,6,0)))","v":""},"","","","","","","","","","","","","","","","","","","","","","","",""]
[539,{"$nulls":9},{"$f":"IF(ISBLANK($B544),0,VLOOKUP($B544,FullDragonTable,2,0))","v":0},"","","","","","","","","","","","","","","","","","","","","","","","","","","",""]
[540,{"$nulls":9},{"$f":"IF(ISBLANK($B545),0,VLOOKUP($B545,FullDragonTable,2,0))","v":0},"","","","","","","","","","","","","","","","","","","","","","","","","","","",""]
[541,{"$nulls":9},{"$f":"IF(ISBLANK($B546),0,VLOOKUP($B546,FullDragonTable,2,0))","v":0},"","","","","","","","","","","","","","","","","","","","","","","","","","","",""]
[542,{"$nulls":9},{"$f":"IF(ISBLANK($B547),0,VLOOKUP($B547,FullDragonTable,2,0))","v":0},"","","","","","","","","","","","","","","","","","","","","","","","","","","",""]
[543,{"$nulls":9},{"$f":"IF(ISBLANK($B548),0,VLOOKUP($B548,FullDragonTable,2,0))","v":0},"","","","","","","","","","","","","","","","","","","","","","","","","","","",""]
[544,{"$nulls":9},{"$f":"IF(ISBLANK($B549),0,VLOOKUP($B549,FullDragonTable,2,0))","v":0},"","","","","","","","","","","","","","","","","","","","","","","","","","","",""]
[545,{"$nulls":9},{"$f":"IF(ISBLANK($B550),0,VLOOKUP($B550,FullDragonTable,2,0))","v":0},"","","","","","","","","","","","","","","","","","","","","","","","","","","",""]
[546,{"$nulls":9},{"$f":"IF(ISBLANK($B551),0,VLOOKUP($B551,FullDragonTable,2,0))","v":0},"","","","","","","","","","","","","","","","","","","","","","","","","","","",""]
[547,{"$nulls":9},{"$f":"IF(ISBLANK($B552),0,VLOOKUP($B552,FullDragonTable,2,0))","v":0},"","","","","","","","","","","","","","","","","","","","","","","","","","","",""]
[548,{"$nulls":9},{"$f":"IF(ISBLANK($B553),0,VLOOKUP($B553,FullDragonTable,2,0))","v":0},"","","","","","","","","","","","","","","","","","","","","","","","","","","",""]
[549,{"$nulls":9},{"$f":"IF(ISBLANK($B554),0,VLOOKUP($B554,FullDragonTable,2,0))","v":0},"","","","","","","","","","","","","","","","","","","","","","","","","","","",""]
[550,{"$nulls":9},{"$f":"IF(ISBLANK($B555),0,VLOOKUP($B555,FullDragonTable,2,0))","v":0},"","","","","","","","","","","","","","","","","","","","","","","","","","","",""]
[551,{"$nulls":9},{"$f":"IF(ISBLANK($B556),0,VLOOKUP($B556,FullDragonTable,2,0))","v":0},"","","","","","","","","","","","","","","","","","","","","","","","","","","",""]
[552,{"$nulls":9},{"$f":"IF(ISBLANK($B557),0,VLOOKUP($B557,FullDragonTable,2,0))","v":0},"","","","","","","","","","","","","","","","","","","","","","","","","","","",""]
[553,{"$nulls":9},{"$f":"IF(ISBLANK($B558),0,VLOOKUP($B558,FullDragonTable,2,0))","v":0},"","","","","","","","","","","","","","","","","","","","","","","","","","","",""]
[554,{"$nulls":9},{"$f":"IF(ISBLANK($B559),0,VLOOKUP($B559,FullDragonTable,2,0))","v":0},"","","","","","","","","","","","","","","","","","","","","","","","","","","",""]
[555,{"$nulls":9},{"$f":"IF(ISBLANK($B560),0,VLOOKUP($B560,FullDragonTable,2,0))","v":0},"","","","","","","","","","","","","","","","","","","","","","","","","","","",""]
[556,{"$nulls":9},{"$f":"IF(ISBLANK($B561),0,VLOOKUP($B561,FullDragonTable,2,0))","v":0},"","","","","","","","","","","","","","","","","","","","","","","","","","","",""]
[557,{"$nulls":9},{"$f":"IF(ISBLANK($B562),0,VLOOKUP($B562,FullDragonTable,2,0))","v":0},"","","","","","","","","","","","","","","","","","","","","","","","","","","",""]
[558,{"$nulls":9},{"$f":"IF(ISBLANK($B563),0,VLOOKUP($B563,FullDragonTable,2,0))","v":0},"","","","","","","","","","","","","","","","","","","","","","","","","","","",""]
[559,{"$nulls":9},{"$f":"IF(ISBLANK($B564),0,VLOOKUP($B564,FullDragonTable,2,0))","v":0},"","","","","","","","","","","","","","","","","","","","","","","","","","","",""]
[560,{"$nulls":9},{"$f":"IF(ISBLANK($B565),0,VLOOKUP($B565,FullDragonTable,2,0))","v":0},"","","","","","","","","","","","","","","","","","","","","","","","","","","",""]
[561,{"$nulls":9},{"$f":"IF(ISBLANK($B566),0,VLOOKUP($B566,FullDragonTable,2,0))","v":0},"","","","","","","","","","","","","","","","","","","","","","","","","","","",""]
[562,{"$nulls":9},{"$f":"IF(ISBLANK($B567),0,VLOOKUP($B567,FullDragonTable,2,0))","v":0},"","","","","","","","","","","","","","","","","","","","","","","","","","","",""]
[563,{"$nulls":9},{"$f":"IF(ISBLANK($B568),0,VLOOKUP($B568,FullDragonTable,2,0))","v":0},"","","","","","","","","","","","","","","","","","","","","","","","","","","",""]
[564,{"$nulls":9},{"$f":"IF(ISBLANK($B569),0,VLOOKUP($B569,FullDragonTable,2,0))","v":0},"","","","","","","","","","","","","","","","","","","","","","","","","","","",""]
[565,{"$nulls":9},{"$f":"IF(ISBLANK($B570),0,VLOOKUP($B570,FullDragonTable,2,0))","v":0},"","","","","","","","","","","","","","","","","","","","","","","","","","","",""]
[566,{"$nulls":9},{"$f":"IF(ISBLANK($B571),0,VLOOKUP($B571,FullDragonTable,2,0))","v":0},"","","","","","","","","","","","","","","","","","","","","","","","","","","",""]
[567,{"$nulls":9},{"$f":"IF(ISBLANK($B572),0,VLOOKUP($B572,FullDragonTable,2,0))","v":0},"","","","","","","","","","","","","","","","","","","","","","","","","","","",""]
[568,{"$nulls":9},{"$f":"IF(ISBLANK($B573),0,VLOOKUP($B573,FullDragonTable,2,0))","v":0},"","","","","","","","","","","","","","","","","","","","","","","","","","","",""]
[569,{"$nulls":9},{"$f":"IF(ISBLANK($B574),0,VLOOKUP($B574,FullDragonTable,2,0))","v":0},"","","","","","","","","","","","","","","","","","","","","","","","","","","",""]
[570,{"$nulls":9},{"$f":"IF(ISBLANK($B575),0,VLOOKUP($B575,FullDragonTable,2,0))","v":0},"","","","","","","","","","","","","","","","","","","","","","","","","","","",""]
[571,{"$nulls":9},{"$f":"IF(ISBLANK($B576),0,VLOOKUP($B576,FullDragonTable,2,0))","v":0},"","","","","","","","","","","","","","","","","","","","","","","","","","","",""]
[572,{"$nulls":9},{"$f":"IF(ISBLANK($B577),0,VLOOKUP($B577,FullDragonTable,2,0))","v":0},"","","","","","","","","","","","","","","","","","","","","","","","","","","",""]
[573,{"$nulls":9},{"$f":"IF(ISBLANK($B578),0,VLOOKUP($B578,FullDragonTable,2,0))","v":0},"","","","","","","","","","","","","","","","","","","","","","","","","","","",""]
[574,{"$nulls":9},{"$f":"IF(ISBLANK($B579),0,VLOOKUP($B579,FullDragonTable,2,0))","v":0},"","","","","","","","","","","","","","","","","","","","","","","","","","","",""]
[575,{"$nulls":9},{"$f":"IF(ISBLANK($B580),0,VLOOKUP($B580,FullDragonTable,2,0))","v":0},"","","","","","","","","","","","","","","","","","","","","","","","","","","",""]
[576,{"$nulls":9},{"$f":"IF(ISBLANK($B581),0,VLOOKUP($B581,FullDragonTable,2,0))","v":0},"","","","","","","","","","","","","","","","","","","","","","","","","","","",""]
[577,{"$nulls":9},{"$f":"IF(ISBLANK($B582),0,VLOOKUP($B582,FullDragonTable,2,0))","v":0},{"$f":"IF(ISBLANK($B582),\"\",IF(ISBLANK(VLOOKUP($B582,FullDragonTable,3,0)),\"\",VLOOKUP($B582,FullDragonTable,3,0)))","v":""},{"$f":"IF(ISBLANK($B582),\"\",IF(ISBLANK(VLOOKUP($B582,FullDragonTable,4,0)),\"\",VLOOKUP($B582,FullDragonTable,4,0)))","v":""},{"$f":"IF(ISBLANK($B582),\"\",IF(ISBLANK(VLOOKUP($B582,FullDragonTable,5,0)),\"\",VLOOKUP($B582,FullDragonTable,5,0)))","v":""},"",{"$f":"IF(ISBLANK($B582),\"\",VLOOKUP($B582,FullDragonTable,7,0))","v":""},{"$f":"IF(ISBLANK($B582),\"\",VLOOKUP(P582,AttackTable,2,0))","v":""},{"$f":"IF(ISBLANK($B582),\"\",VLOOKUP(P582,AttackTable,3,0))","v":""},{"$f":"IF(ISBLANK($B582),\"\",VLOOKUP($B582,FullDragonTable,8,0))","v":""},{"$f":"IF(ISBLANK($B582),\"\",VLOOKUP(S582,AttackTable,2,0))","v":""},{"$f":"IF(ISBLANK($B582),\"\",VLOOKUP(S582,AttackTable,3,0))","v":""},{"$f":"IF(ISBLANK($B582),\"\",VLOOKUP($B582,FullDragonTable,9,0))","v":""},{"$f":"IF(ISBLANK($B582),\"\",VLOOKUP(V582,AttackTable,2,0))","v":""},{"$f":"IF(ISBLANK($B582),\"\",VLOOKUP(V582,AttackTable,3,0))","v":""},{"$f":"IF(ISBLANK($B582),\"\",VLOOKUP($B582,FullDragonTable,10,0))","v":""},{"$f":"IF(ISBLANK($B582),\"\",VLOOKUP(Y582,AttackTable,2,0))","v":""},{"$f":"IF(ISBLANK($B582),\"\",VLOOKUP(Y582,AttackTable,3,0))","v":""},{"$f":"IF(ISBLANK($B582),\"\",VLOOKUP($B582,FullDragonTable,11,0))","v":""},{"$f":"IF(ISBLANK($B582),\"\",VLOOKUP(AB582,AttackTable,2,0))","v":""},{"$f":"IF(ISBLANK($B582),\"\",VLOOKUP(AB582,AttackTable,3,0))","v":""},{"$f":"IF(ISBLANK($B582),\"\",VLOOKUP($B582,FullDragonTable,12,0))","v":""},{"$f":"IF(ISBLANK($B582),\"\",VLOOKUP(AE582,AttackTable,2,0))","v":""},{"$f":"IF(ISBLANK($B582),\"\",VLOOKUP(AE582,AttackTable,3,0))","v":""},{"$f":"IF(ISBLANK($B582),\"\",VLOOKUP($B582,FullDragonTable,13,0))","v":""},{"$f":"IF(ISBLANK($B582),\"\",VLOOKUP(AH582,AttackTable,2,0))","v":""},{"$f":"IF(ISBLANK($B582),\"\",VLOOKUP(AH582,AttackTable,3,0))","v":""},{"$f":"IF(ISBLANK($B582),\"\",VLOOKUP($B582,FullDragonTable,14,0))","v":""},{"$f":"IF(ISBLANK($B582),\"\",VLOOKUP(AK582,AttackTable,2,0))","v":""},{"$f":"IF(ISBLANK($B582),\"\",VLOOKUP(AK582,AttackTable,3,0))","v":""}]
[578,{"$nulls":9},{"$f":"IF(ISBLANK($B583),0,VLOOKUP($B583,FullDragonTable,2,0))","v":0},"","","","","","","","","","","","","","","","","","","","","","","","","","","",""]
[579,{"$nulls":9},{"$f":"IF(ISBLANK($B584),0,VLOOKUP($B584,FullDragonTable,2,0))","v":0},"","","","","","","","","","","","","","","","","","","","","","","","","","","",""]
[580,{"$nulls":9},{"$f":"IF(ISBLANK($B585),0,VLOOKUP($B585,FullDragonTable,2,0))","v":0},"","","","","","","","","","","","","","","","","","","","","","","","","","","",""]
[581,{"$nulls":9},{"$f":"IF(ISBLANK($B586),0,VLOOKUP($B586,FullDragonTable,2,0))","v":0},"","","","","","","","","","","","","","","","","","","","","","","","","","","",""]
[582,{"$nulls":9},{"$f":"IF(ISBLANK($B587),0,VLOOKUP($B587,FullDragonTable,2,0))","v":0},"","","","","","","","","","","","","","","","","","","","","","","","","","","",""]
[583,{"$nulls":9},{"$f":"IF(ISBLANK($B588),0,VLOOKUP($B588,FullDragonTable,2,0))","v":0},"","","","","","","","","","","","","","","","","","","","","","","","","","","",""]
[584,{"$nulls":9},{"$f":"IF(ISBLANK($B589),0,VLOOKUP($B589,FullDragonTable,2,0))","v":0},"","","","","","","","","","","","","","","","","","","","","","","","","","","",""]
[585,{"$nulls":9},{"$f":"IF(ISBLANK($B590),0,VLOOKUP($B590,FullDragonTable,2,0))","v":0},"","","","","","","","","","","","","","","","","","","","","","","","","","","",""]
[586,{"$nulls":9},{"$f":"IF(ISBLANK($B591),0,VLOOKUP($B591,FullDragonTable,2,0))","v":0},"","","","","","","","","","","","","","","","","","","","","","","","","","","",""]
[587,{"$nulls":9},{"$f":"IF(ISBLANK($B592),0,VLOOKUP($B592,FullDragonTable,2,0))","v":0},"","","","","","","","","","","","","","","","","","","","","","","","","","","",""]
[588,{"$nulls":9},{"$f":"IF(ISBLANK($B593),0,VLOOKUP($B593,FullDragonTable,2,0))","v":0},"","","","","","","","","","","","","","","","","","","","","","","","","","","",""]
[589,{"$nulls":9},{"$f":"IF(ISBLANK($B594),0,VLOOKUP($B594,FullDragonTable,2,0))","v":0},"","","","","","","","","","","","","","","","","","","","","","","","","","","",""]
[590,{"$nulls":9},{"$f":"IF(ISBLANK($B595),0,VLOOKUP($B595,FullDragonTable,2,0))","v":0},"","","","","","","","","","","","","","","","","","","","","","","","","","","",""]
[591,{"$nulls":9},{"$f":"IF(ISBLANK($B596),0,VLOOKUP($B596,FullDragonTable,2,0))","v":0},"","","","","","","","","","","","","","","","","","","","","","","","","","","",""]
[592,{"$nulls":9},{"$f":"IF(ISBLANK($B597),0,VLOOKUP($B597,FullDragonTable,2,0))","v":0},"","","","","","","","","","","","","","","","","","","","","","","","","","","",""]
[593,{"$nulls":9},{"$f":"IF(ISBLANK($B598),0,VLOOKUP($B598,FullDragonTable,2,0))","v":0},"","","","","","","","","","","","","","","","","","","","","","","","","","","",""]
[594,{"$nulls":9},{"$f":"IF(ISBLANK($B599),0,VLOOKUP($B599,FullDragonTable,2,0))","v":0},"","","","","","","","","","","","","","","","","","","","","","","","","","","",""]
[595,{"$nulls":9},{"$f":"IF(ISBLANK($B600),0,VLOOKUP($B600,FullDragonTable,2,0))","v":0},"","","","","","","","","","","","","","","","","","","","","","","","","","","",""]
[596,{"$nulls":9},{"$f":"IF(ISBLANK($B601),0,VLOOKUP($B601,FullDragonTable,2,0))","v":0},"","","","","","","","","","","","","","","","","","","","","","","","","","","",""]
[597,{"$nulls":9},{"$f":"IF(ISBLANK($B602),0,VLOOKUP($B602,FullDragonTable,2,0))","v":0},"","","","","","","","","","","","","","","","","","","","","","","","","","","",""]
[598,{"$nulls":9},{"$f":"IF(ISBLANK($B603),0,VLOOKUP($B603,FullDragonTable,2,0))","v":0},"","","","","","","","","","","","","","","","","","","","","","","","","","","",""]
[599,{"$nulls":9},{"$f":"IF(ISBLANK($B604),0,VLOOKUP($B604,FullDragonTable,2,0))","v":0},"","","","","","","","","","","","","","","","","","","","","","","","","","","",""]
[600,{"$nulls":9},{"$f":"IF(ISBLANK($B605),0,VLOOKUP($B605,FullDragonTable,2,0))","v":0},"","","","","","","","","","","","","","","","","","","","","","","","","","","",""]
[601,{"$nulls":9},{"$f":"IF(ISBLANK($B606),0,VLOOKUP($B606,FullDragonTable,2,0))","v":0},"","","","","","","","","","","","","","","","","","","","","","","","","","","",""]
[602,{"$nulls":9},{"$f":"IF(ISBLANK($B607),0,VLOOKUP($B607,FullDragonTable,2,0))","v":0},"","","",{"$f":"IF(ISBLANK($B607),\"\",IF(ISBLANK(VLOOKUP($B607,FullDragonTable,6,0)),\"\",VLOOKUP($B607,FullDragonTable,6,0)))","v":""},"","","","","","","","","","","","","","","","","","","","","","","",""]
[603,{"$nulls":9},{"$f":"IF(ISBLANK($B608),0,VLOOKUP($B608,FullDragonTable,2,0))","v":0},"","","","","","","","","","","","","","","","","","","","","","","","","","","",""]
[604,{"$nulls":9},{"$f":"IF(ISBLANK($B609),0,VLOOKUP($B609,FullDragonTable,2,0))","v":0},"","","","","","","","","","","","","","","","","","","","","","","","","","","",""]
[605,{"$nulls":9},{"$f":"IF(ISBLANK($B610),0,VLOOKUP($B610,FullDragonTable,2,0))","v":0},"","","","","","","","","","","","","","","","","","","","","","","","","","","",""]
[606,{"$nulls":9},{"$f":"IF(ISBLANK($B611),0,VLOOKUP($B611,FullDragonTable,2,0))","v":0},"","","","","","","","","","","","","","","","","","","","","","","","","","","",""]
[607,{"$nulls":9},{"$f":"IF(ISBLANK($B612),0,VLOOKUP($B612,FullDragonTable,2,0))","v":0},"","","","","","","","","","","","","","","","","","","","","","","","","","","",""]
[608,{"$nulls":9},{"$f":"IF(ISBLANK($B613),0,VLOOKUP($B613,FullDragonTable,2,0))","v":0},"","","","","","","","","","","","","","","","","","","","","","","","","","","",""]
[609,{"$nulls":9},{"$f":"IF(ISBLANK($B614),0,VLOOKUP($B614,FullDragonTable,2,0))","v":0},"","","","","","","","","","","","","","","","","","","","","","","","","","","",""]
[610,{"$nulls":9},{"$f":"IF(ISBLANK($B615),0,VLOOKUP($B615,FullDragonTable,2,0))","v":0},"","","","","","","","","","","","","","","","","","","","","","","","","","","",""]
[611,{"$nulls":9},{"$f":"IF(ISBLANK($B616),0,VLOOKUP($B616,FullDragonTable,2,0))","v":0},"","","","","","","","","","","","","","","","","","","","","","","","","","","",""]
[612,{"$nulls":9},{"$f":"IF(ISBLANK($B617),0,VLOOKUP($B617,FullDragonTable,2,0))","v":0},"","","","","","","","","","","","","","","","","","","","","","","","","","","",""]
[613,{"$nulls":9},{"$f":"IF(ISBLANK($B618),0,VLOOKUP($B618,FullDragonTable,2,0))","v":0},"","","","","","","","","","","","","","","","","","","","","","","","","","","",""]
[614,{"$nulls":9},{"$f":"IF(ISBLANK($B619),0,VLOOKUP($B619,FullDragonTable,2,0))","v":0},"","","","","","","","","","","","","","","","","","","","","","","","","","","",""]
[615,{"$nulls":9},{"$f":"IF(ISBLANK($B620),0,VLOOKUP($B620,FullDragonTable,2,0))","v":0},"","","","","","","","","","","","","","","","","","","","","","","","","","","",""]
[616,{"$nulls":9},{"$f":"IF(ISBLANK($B621),0,VLOOKUP($B621,FullDragonTable,2,0))","v":0},"","","","","","","","","","","","","","","","","","","","","","","","","","","",""]
[617,{"$nulls":9},{"$f":"IF(ISBLANK($B622),0,VLOOKUP($B622,FullDragonTable,2,0))","v":0},"","","","","","","","","","","","","","","","","","","","","","","","","","","",""]
[618,{"$nulls":9},{"$f":"IF(ISBLANK($B623),0,VLOOKUP($B623,FullDragonTable,2,0))","v":0},"","","","","","","","","","","","","","","","","","","","","","","","","","","",""]
[619,{"$nulls":9},{"$f":"IF(ISBLANK($B624),0,VLOOKUP($B624,FullDragonTable,2,0))","v":0},"","","","","","","","","","","","","","","","","","","","","","","","","","","",""]
[620,{"$nulls":9},{"$f":"IF(ISBLANK($B625),0,VLOOKUP($B625,FullDragonTable,2,0))","v":0},"","","","","","","","","","","","","","","","","","","","","","","","","","","",""]
[621,{"$nulls":9},{"$f":"IF(ISBLANK($B626),0,VLOOKUP($B626,FullDragonTable,2,0))","v":0},"","","","","","","","","","","","","","","","","","","","","","","","","","","",""]
[622,{"$nulls":9},{"$f":"IF(ISBLANK($B627),0,VLOOKUP($B627,FullDragonTable,2,0))","v":0},"","","","","","","","","","","","","","","","","","","","","","","","","","","",""]
[623,{"$nulls":9},{"$f":"IF(ISBLANK($B628),0,VLOOKUP($B628,FullDragonTable,2,0))","v":0},"","","","","","","","","","","","","","","","","","","","","","","","","","","",""]
[624,{"$nulls":9},{"$f":"IF(ISBLANK($B629),0,VLOOKUP($B629,FullDragonTable,2,0))","v":0},"","","","","","","","","","","","","","","","","","","","","","","","","","","",""]
[625,{"$nulls":9},{"$f":"IF(ISBLANK($B630),0,VLOOKUP($B630,FullDragonTable,2,0))","v":0},"","","","","","","","","","","","","","","","","","","","","","","","","","","",""]
[626,{"$nulls":9},{"$f":"IF(ISBLANK($B631),0,VLOOKUP($B631,FullDragonTable,2,0))","v":0},"","","","","","","","","","","","","","","","","","","","","","","","","","","",""]
[627,{"$nulls":9},{"$f":"IF(ISBLANK($B632),0,VLOOKUP($B632,FullDragonTable,2,0))","v":0},"","","","","","","","","","","","","","","","","","","","","","","","","","","",""]
[628,{"$nulls":9},{"$f":"IF(ISBLANK($B633),0,VLOOKUP($B633,FullDragonTable,2,0))","v":0},"","","","","","","","","","","","","","","","","","","","","","","","","","","",""]
[629,{"$nulls":9},{"$f":"IF(ISBLANK($B634),0,VLOOKUP($B634,FullDragonTable,2,0))","v":0},"","","","","","","","","","","","","","","","","","","","","","","","","","","",""]
[630,{"$nulls":9},{"$f":"IF(ISBLANK($B635),0,VLOOKUP($B635,FullDragonTable,2,0))","v":0},"","","","","","","","","","","","","","","","","","","","","","","","","","","",""]
[631,{"$nulls":9},{"$f":"IF(ISBLANK($B636),0,VLOOKUP($B636,FullDragonTable,2,0))","v":0},"","","","","","","","","","","","","","","","","","","","","","","","","","","",""]
[632,{"$nulls":9},{"$f":"IF(ISBLANK($B637),0,VLOOKUP($B637,FullDragonTable,2,0))","v":0},"","","","","","","","","","","","","","","","","","","","","","","","","","","",""]
[633,{"$nulls":9},{"$f":"IF(ISBLANK($B638),0,VLOOKUP($B638,FullDragonTable,2,0))","v":0},"","","","","","","","","","","","","","","","","","","","","","","","","","","",""]
[634,{"$nulls":9},{"$f":"IF(ISBLANK($B639),0,VLOOKUP($B639,FullDragonTable,2,0))","v":0},"","","","","","","","","","","","","","","","","","","","","","","","","","","",""]
[635,{"$nulls":9},{"$f":"IF(ISBLANK($B640),0,VLOOKUP($B640,FullDragonTable,2,0))","v":0},"","","","","","","","","","","","","","","","","","","","","","","","","","","",""]
[636,{"$nulls":9},{"$f":"IF(ISBLANK($B641),0,VLOOKUP($B641,FullDragonTable,2,0))","v":0},"","","","","","","","","","","","","","","","","","","","","","","","","","","",""]
[637,{"$nulls":9},{"$f":"IF(ISBLANK($B642),0,VLOOKUP($B642,FullDragonTable,2,0))","v":0},"","","","","","","","","","","","","","","","","","","","","","","","","","","",""]
[638,{"$nulls":9},{"$f":"IF(ISBLANK($B643),0,VLOOKUP($B643,FullDragonTable,2,0))","v":0},"","","","","","","","","","","","","","","","","","","","","","","","","","","",""]
[639,{"$nulls":9},{"$f":"IF(ISBLANK($B644),0,VLOOKUP($B644,FullDragonTable,2,0))","v":0},"","","","","","","","","","","","","","","","","","","","","","","","","","","",""]
[640,{"$nulls":9},{"$f":"IF(ISBLANK($B645),0,VLOOKUP($B645,FullDragonTable,2,0))","v":0},"","","","","","","","","","","","","","","","","","","","","","","","","","","",""]
[641,{"$nulls":9},{"$f":"IF(ISBLANK($B646),0,VLOOKUP($B646,FullDragonTable,2,0))","v":0},{"$f":"IF(ISBLANK($B646),\"\",IF(ISBLANK(VLOOKUP($B646,FullDragonTable,3,0)),\"\",VLOOKUP($B646,FullDragonTable,3,0)))","v":""},{"$f":"IF(ISBLANK($B646),\"\",IF(ISBLANK(VLOOKUP($B646,FullDragonTable,4,0)),\"\",VLOOKUP($B646,FullDragonTable,4,0)))","v":""},{"$f":"IF(ISBLANK($B646),\"\",IF(ISBLANK(VLOOKUP($B646,FullDragonTable,5,0)),\"\",VLOOKUP($B646,FullDragonTable,5,0)))","v":""},"",{"$f":"IF(ISBLANK($B646),\"\",VLOOKUP($B646,FullDragonTable,7,0))","v":""},{"$f":"IF(ISBLANK($B646),\"\",VLOOKUP(P646,AttackTable,2,0))","v":""},{"$f":"IF(ISBLANK($B646),\"\",VLOOKUP(P646,AttackTable,3,0))","v":""},{"$f":"IF(ISBLANK($B646),\"\",VLOOKUP($B646,FullDragonTable,8,0))","v":""},{"$f":"IF(ISBLANK($B646),\"\",VLOOKUP(S646,AttackTable,2,0))","v":""},{"$f":"IF(ISBLANK($B646),\"\",VLOOKUP(S646,AttackTable,3,0))","v":""},{"$f":"IF(ISBLANK($B646),\"\",VLOOKUP($B646,FullDragonTable,9,0))","v":""},{"$f":"IF(ISBLANK($B646),\"\",VLOOKUP(V646,AttackTable,2,0))","v":""},{"$f":"IF(ISBLANK($B646),\"\",VLOOKUP(V646,AttackTable,3,0))","v":""},{"$f":"IF(ISBLANK($B646),\"\",VLOOKUP($B646,FullDragonTable,10,0))","v":""},{"$f":"IF(ISBLANK($B646),\"\",VLOOKUP(Y646,AttackTable,2,0))","v":""},{"$f":"IF(ISBLANK($B646),\"\",VLOOKUP(Y646,AttackTable,3,0))","v":""},{"$f":"IF(ISBLANK($B646),\"\",VLOOKUP($B646,FullDragonTable,11,0))","v":""},{"$f":"IF(ISBLANK($B646),\"\",VLOOKUP(AB646,AttackTable,2,0))","v":""},{"$f":"IF(ISBLANK($B646),\"\",VLOOKUP(AB646,AttackTable,3,0))","v":""},{"$f":"IF(ISBLANK($B646),\"\",VLOOKUP($B646,FullDragonTable,12,0))","v":""},{"$f":"IF(ISBLANK($B646),\"\",VLOOKUP(AE646,AttackTable,2,0))","v":""},{"$f":"IF(ISBLANK($B646),\"\",VLOOKUP(AE646,AttackTable,3,0))","v":""},{"$f":"IF(ISBLANK($B646),\"\",VLOOKUP($B646,FullDragonTable,13,0))","v":""},{"$f":"IF(ISBLANK($B646),\"\",VLOOKUP(AH646,AttackTable,2,0))","v":""},{"$f":"IF(ISBLANK($B646),\"\",VLOOKUP(AH646,AttackTable,3,0))","v":""},{"$f":"IF(ISBLANK($B646),\"\",VLOOKUP($B646,FullDragonTable,14,0))","v":""},{"$f":"IF(ISBLANK($B646),\"\",VLOOKUP(AK646,AttackTable,2,0))","v":""},{"$f":"IF(ISBLANK($B646),\"\",VLOOKUP(AK646,AttackTable,3,0))","v":""}]
[642,{"$nulls":9},{"$f":"IF(ISBLANK($B647),0,VLOOKUP($B647,FullDragonTable,2,0))","v":0},"","","","","","","","","","","","","","","","","","","","","","","","","","","",""]
[643,{"$nulls":9},{"$f":"IF(ISBLANK($B648),0,VLOOKUP($B648,FullDragonTable,2,0))","v":0},"","","","","","","","","","","","","","","","","","","","","","","","","","","",""]
[644,{"$nulls":9},{"$f":"IF(ISBLANK($B649),0,VLOOKUP($B649,FullDragonTable,2,0))","v":0},"","","","","","","","","","","","","","","","","","","","","","","","","","","",""]
[645,{"$nulls":9},{"$f":"IF(ISBLANK($B650),0,VLOOKUP($B650,FullDragonTable,2,0))","v":0},"","","","","","","","","","","","","","","","","","","","","","","","","","","",""]
[646,{"$nulls":9},{"$f":"IF(ISBLANK($B651),0,VLOOKUP($B651,FullDragonTable,2,0))","v":0},"","","","","","","","","","","","","","","","","","","","","","","","","","","",""]
[647,{"$nulls":9},{"$f":"IF(ISBLANK($B652),0,VLOOKUP($B652,FullDragonTable,2,0))","v":0},"","","","","","","","","","","","","","","","","","","","","","","","","","","",""]
[648,{"$nulls":9},{"$f":"IF(ISBLANK($B653),0,VLOOKUP($B653,FullDragonTable,2,0))","v":0},"","","","","","","","","","","","","","","","","","","","","","","","","","","",""]
[649,{"$nulls":9},{"$f":"IF(ISBLANK($B654),0,VLOOKUP($B654,FullDragonTable,2,0))","v":0},"","","","","","","","","","","","","","","","","","","","","","","","","","","",""]
[650,{"$nulls":9},{"$f":"IF(ISBLANK($B655),0,VLOOKUP($B655,FullDragonTable,2,0))","v":0},"","","","","","","","","","","","","","","","","","","","","","","","","","","",""]
[651,{"$nulls":9},{"$f":"IF(ISBLANK($B656),0,VLOOKUP($B656,FullDragonTable,2,0))","v":0},"","","","","","","","","","","","","","","","","","","","","","","","","","","",""]
[652,{"$nulls":9},{"$f":"IF(ISBLANK($B657),0,VLOOKUP($B657,FullDragonTable,2,0))","v":0},"","","","","","","","","","","","","","","","","","","","","","","","","","","",""]
[653,{"$nulls":9},{"$f":"IF(ISBLANK($B658),0,VLOOKUP($B658,FullDragonTable,2,0))","v":0},"","","","","","","","","","","","","","","","","","","","","","","","","","","",""]
[654,{"$nulls":9},{"$f":"IF(ISBLANK($B659),0,VLOOKUP($B659,FullDragonTable,2,0))","v":0},"","","","","","","","","","","","","","","","","","","","","","","","","","","",""]
[655,{"$nulls":9},{"$f":"IF(ISBLANK($B660),0,VLOOKUP($B660,FullDragonTable,2,0))","v":0},"","","","","","","","","","","","","","","","","","","","","","","","","","","",""]
[656,{"$nulls":9},{"$f":"IF(ISBLANK($B661),0,VLOOKUP($B661,FullDragonTable,2,0))","v":0},"","","","","","","","","","","","","","","","","","","","","","","","","","","",""]
[657,{"$nulls":9},{"$f":"IF(ISBLANK($B662),0,VLOOKUP($B662,FullDragonTable,2,0))","v":0},"","","","","","","","","","","","","","","","","","","","","","","","","","","",""]
[658,{"$nulls":9},{"$f":"IF(ISBLANK($B663),0,VLOOKUP($B663,FullDragonTable,2,0))","v":0},"","","","","","","","","","","","","","","","","","","","","","","","","","","",""]
[659,{"$nulls":9},{"$f":"IF(ISBLANK($B664),0,VLOOKUP($B664,FullDragonTable,2,0))","v":0},"","","","","","","","","","","","","","","","","","","","","","","","","","","",""]
[660,{"$nulls":9},{"$f":"IF(ISBLANK($B665),0,VLOOKUP($B665,FullDragonTable,2,0))","v":0},"","","","","","","","","","","","","","","","","","","","","","","","","","","",""]
[661,{"$nulls":9},{"$f":"IF(ISBLANK($B666),0,VLOOKUP($B666,FullDragonTable,2,0))","v":0},"","","","","","","","","","","","","","","","","","","","","","","","","","","",""]
[662,{"$nulls":9},{"$f":"IF(ISBLANK($B667),0,VLOOKUP($B667,FullDragonTable,2,0))","v":0},"","","","","","","","","","","","","","","","","","","","","","","","","","","",""]
[663,{"$nulls":9},{"$f":"IF(ISBLANK($B668),0,VLOOKUP($B668,FullDragonTable,2,0))","v":0},"","","","","","","","","","","","","","","","","","","","","","","","","","","",""]
[664,{"$nulls":9},{"$f":"IF(ISBLANK($B669),0,VLOOKUP($B669,FullDragonTable,2,0))","v":0},"","","","","","","","","","","","","","","","","","","","","","","","","","","",""]
[665,{"$nulls":9},{"$f":"IF(ISBLANK($B670),0,VLOOKUP($B670,FullDragonTable,2,0))","v":0},"","","","","","","","","","","","","","","","","","","","","","","","","","","",""]
[666,{"$nulls":9},{"$f":"IF(ISBLANK($B671),0,VLOOKUP($B671,FullDragonTable,2,0))","v":0},"","","",{"$f":"IF(ISBLANK($B671),\"\",IF(ISBLANK(VLOOKUP($B671,FullDragonTable,6,0)),\"\",VLOOKUP($B671,FullDragonTable,6,0)))","v":""},"","","","","","","","","","","","","","","","","","","","","","","",""]
[667,{"$nulls":9},{"$f":"IF(ISBLANK($B672),0,VLOOKUP($B672,FullDragonTable,2,0))","v":0},"","","","","","","","","","","","","","","","","","","","","","","","","","","",""]
[668,{"$nulls":9},{"$f":"IF(ISBLANK($B673),0,VLOOKUP($B673,FullDragonTable,2,0))","v":0},"","","","","","","","","","","","","","","","","","","","","","","","","","","",""]
[669,{"$nulls":9},{"$f":"IF(ISBLANK($B674),0,VLOOKUP($B674,FullDragonTable,2,0))","v":0},"","","","","","","","","","","","","","","","","","","","","","","","","","","",""]
[670,{"$nulls":9},{"$f":"IF(ISBLANK($B675),0,VLOOKUP($B675,FullDragonTable,2,0))","v":0},"","","","","","","","","","","","","","","","","","","","","","","","","","","",""]
[671,{"$nulls":9},{"$f":"IF(ISBLANK($B676),0,VLOOKUP($B676,FullDragonTable,2,0))","v":0},"","","","","","","","","","","","","","","","","","","","","","","","","","","",""]
[672,{"$nulls":9},{"$f":"IF(ISBLANK($B677),0,VLOOKUP($B677,FullDragonTable,2,0))","v":0},"","","","","","","","","","","","","","","","","","","","","","","","","","","",""]
[673,{"$nulls":9},{"$f":"IF(ISBLANK($B678),0,VLOOKUP($B678,FullDragonTable,2,0))","v":0},"","","","","","","","","","","","","","","","","","","","","","","","","","","",""]
[674,{"$nulls":9},{"$f":"IF(ISBLANK($B679),0,VLOOKUP($B679,FullDragonTable,2,0))","v":0},"","","","","","","","","","","","","","","","","","","","","","","","","","","",""]
[675,{"$nulls":9},{"$f":"IF(ISBLANK($B680),0,VLOOKUP($B680,FullDragonTable,2,0))","v":0},"","","","","","","","","","","","","","","","","","","","","","","","","","","",""]
[676,{"$nulls":9},{"$f":"IF(ISBLANK($B681),0,VLOOKUP($B681,FullDragonTable,2,0))","v":0},"","","","","","","","","","","","","","","","","","","","","","","","","","","",""]
[677,{"$nulls":9},{"$f":"IF(ISBLANK($B682),0,VLOOKUP($B682,FullDragonTable,2,0))","v":0},"","","","","","","","","","","","","","","","","","","","","","","","","","","",""]
[678,{"$nulls":9},{"$f":"IF(ISBLANK($B683),0,VLOOKUP($B683,FullDragonTable,2,0))","v":0},"","","","","","","","","","","","","","","","","","","","","","","","","","","",""]
[679,{"$nulls":9},{"$f":"IF(ISBLANK($B684),0,VLOOKUP($B684,FullDragonTable,2,0))","v":0},"","","","","","","","","","","","","","","","","","","","","","","","","","","",""]
[680,{"$nulls":9},{"$f":"IF(ISBLANK($B685),0,VLOOKUP($B685,FullDragonTable,2,0))","v":0},"","","","","","","","","","","","","","","","","","","","","","","","","","","",""]
[681,{"$nulls":9},{"$f":"IF(ISBLANK($B686),0,VLOOKUP($B686,FullDragonTable,2,0))","v":0},"","","","","","","","","","","","","","","","","","","","","","","","","","","",""]
[682,{"$nulls":9},{"$f":"IF(ISBLANK($B687),0,VLOOKUP($B687,FullDragonTable,2,0))","v":0},"","","","","","","","","","","","","","","","","","","","","","","","","","","",""]
[683,{"$nulls":9},{"$f":"IF(ISBLANK($B688),0,VLOOKUP($B688,FullDragonTable,2,0))","v":0},"","","","","","","","","","","","","","","","","","","","","","","","","","","",""]
[684,{"$nulls":9},{"$f":"IF(ISBLANK($B689),0,VLOOKUP($B689,FullDragonTable,2,0))","v":0},"","","","","","","","","","","","","","","","","","","","","","","","","","","",""]
[685,{"$nulls":9},{"$f":"IF(ISBLANK($B690),0,VLOOKUP($B690,FullDragonTable,2,0))","v":0},"","","","","","","","","","","","","","","","","","","","","","","","","","","",""]
[686,{"$nulls":9},{"$f":"IF(ISBLANK($B691),0,VLOOKUP($B691,FullDragonTable,2,0))","v":0},"","","","","","","","","","","","","","","","","","","","","","","","","","","",""]
[687,{"$nulls":9},{"$f":"IF(ISBLANK($B692),0,VLOOKUP($B692,FullDragonTable,2,0))","v":0},"","","","","","","","","","","","","","","","","","","","","","","","","","","",""]
[688,{"$nulls":9},{"$f":"IF(ISBLANK($B693),0,VLOOKUP($B693,FullDragonTable,2,0))","v":0},"","","","","","","","","","","","","","","","","","","","","","","","","","","",""]
[689,{"$nulls":9},{"$f":"IF(ISBLANK($B694),0,VLOOKUP($B694,FullDragonTable,2,0))","v":0},"","","","","","","","","","","","","","","","","","","","","","","","","","","",""]
[690,{"$nulls":9},{"$f":"IF(ISBLANK($B695),0,VLOOKUP($B695,FullDragonTable,2,0))","v":0},"","","","","","","","","","","","","","","","","","","","","","","","","","","",""]
[691,{"$nulls":9},{"$f":"IF(ISBLANK($B696),0,VLOOKUP($B696,FullDragonTable,2,0))","v":0},"","","","","","","","","","","","","","","","","","","","","","","","","","","",""]
[692,{"$nulls":9},{"$f":"IF(ISBLANK($B697),0,VLOOKUP($B697,FullDragonTable,2,0))","v":0},"","","","","","","","","","","","","","","","","","","","","","","","","","","",""]
[693,{"$nulls":9},{"$f":"IF(ISBLANK($B698),0,VLOOKUP($B698,FullDragonTable,2,0))","v":0},"","","","","","","","","","","","","","","","","","","","","","","","","","","",""]
[694,{"$nulls":9},{"$f":"IF(ISBLANK($B699),0,VLOOKUP($B699,FullDragonTable,2,0))","v":0},"","","","","","","","","","","","","","","","","","","","","","","","","","","",""]
[695,{"$nulls":9},{"$f":"IF(ISBLANK($B700),0,VLOOKUP($B700,FullDragonTable,2,0))","v":0},"","","","","","","","","","","","","","","","","","","","","","","","","","","",""]
[696,{"$nulls":9},{"$f":"IF(ISBLANK($B701),0,VLOOKUP($B701,FullDragonTable,2,0))","v":0},"","","","","","","","","","","","","","","","","","","","","","","","","","","",""]
[697,{"$nulls":9},{"$f":"IF(ISBLANK($B702),0,VLOOKUP($B702,FullDragonTable,2,0))","v":0},"","","","","","","","","","","","","","","","","","","","","","","","","","","",""]
[698,{"$nulls":9},{"$f":"IF(ISBLANK($B703),0,VLOOKUP($B703,FullDragonTable,2,0))","v":0},"","","","","","","","","","","","","","","","","","","","","","","","","","","",""]
[699,{"$nulls":9},{"$f":"IF(ISBLANK($B704),0,VLOOKUP($B704,FullDragonTable,2,0))","v":0},"","","","","","","","","","","","","","","","","","","","","","","","","","","",""]
[700,{"$nulls":9},{"$f":"IF(ISBLANK($B705),0,VLOOKUP($B705,FullDragonTable,2,0))","v":0},"","","","","","","","","","","","","","","","","","","","","","","","","","","",""]
[701,{"$nulls":9},{"$f":"IF(ISBLANK($B706),0,VLOOKUP($B706,FullDragonTable,2,0))","v":0},"","","","","","","","","","","","","","","","","","","","","","","","","","","",""]
[702,{"$nulls":9},{"$f":"IF(ISBLANK($B707),0,VLOOKUP($B707,FullDragonTable,2,0))","v":0},"","","","","","","","","","","","","","","","","","","","","","","","","","","",""]
[703,{"$nulls":9},{"$f":"IF(ISBLANK($B708),0,VLOOKUP($B708,FullDragonTable,2,0))","v":0},"","","","","","","","","","","","","","","","","","","","","","","","","","","",""]
[704,{"$nulls":9},{"$f":"IF(ISBLANK($B709),0,VLOOKUP($B709,FullDragonTable,2,0))","v":0},"","","","","","","","","","","","","","","","","","","","","","","","","","","",""]
[705,{"$nulls":9},{"$f":"IF(ISBLANK($B710),0,VLOOKUP($B710,FullDragonTable,2,0))","v":0},"","","","","",{"$f":"IF(ISBLANK($B710),\"\",VLOOKUP(P710,AttackTable,2,0))","v":""},"","",{"$f":"IF(ISBLANK($B710),\"\",VLOOKUP(S710,AttackTable,2,0))","v":""},"","",{"$f":"IF(ISBLANK($B710),\"\",VLOOKUP(V710,AttackTable,2,0))","v":""},"","",{"$f":"IF(ISBLANK($B710),\"\",VLOOKUP(Y710,AttackTable,2,0))","v":""},"","",{"$f":"IF(ISBLANK($B710),\"\",VLOOKUP(AB710,AttackTable,2,0))","v":""},"","",{"$f":"IF(ISBLANK($B710),\"\",VLOOKUP(AE710,AttackTable,2,0))","v":""},"","",{"$f":"IF(ISBLANK($B710),\"\",VLOOKUP(AH710,AttackTable,2,0))","v":""},"","",{"$f":"IF(ISBLANK($B710),\"\",VLOOKUP(AK710,AttackTable,2,0))","v":""},""]

{"sheet":"Habitats","index":2,"n_rows":38,"n_cols":10,"rows_kept":38,"merged":[[2,5,2,6],[2,8,2,9],[4,8,5,8],[4,9,5,9],[6,8,7,8],[6,9,7,9],[8,8,9,8],[8,9,9,9],[10,8,11,8],[10,9,11,9],[12,8,13,8],[12,9,13,9],[14,8,15,8],[14,9,15,9],[16,8,17,8],[16,9,17,9],[18,8,19,8],[18,9,19,9],[20,8,21,8],[20,9,21,9],[22,8,23,8],[22,9,23,9]]}
["Habitats"]
[]
[{"$nulls":5},"Dragons",null,null,"% Used"]
["Habitat","Capacity","Build","Island","Storage","Total","Island","Used","Total","Island"]
["Terra",2,"10s",1,0,{"$f":"(D5+E5)*B5","v":2},{"$f":"D5*B5","v":2},{"$f":"COUNTIF('My Dragons'!$F$6:$F$710,A5)","v":1},{"$f":"IF((F5+F6)=0,0,(H5+H6)/(F5+F6))","v":{"v":0.5,"d":"50%"}},{"$f":"IF((H5+H6)=0,0,(H5+H6)/(G5+G6))","v":{"v":0.5,"d":"50%"}}]
["Big Terra",4,"30s",0,0,{"$f":"(D6+E6)*B6","v":0},{"$f":"D6*B6","v":0},{"$f":"COUNTIF('My Dragons'!$F$6:$F$710,A6)","v":0}]
["Flame",2,"10s",1,0,{"$f":"(D7+E7)*B7","v":2},2,{"$f":"COUNTIF('My Dragons'!$F$6:$F$710,A7)","v":1},{"$f":"IF((F7+F8)=0,0,(H7+H8)/(F7+F8))","v":{"v":0.5,"d":"50%"}},{"$f":"IF((H7+H8)=0,0,(H7+H8)/(G7+G8))","v":{"v":0.5,"d":"50%"}}]
["Big Flame",4,"2h",0,0,0,0,{"$f":"COUNTIF('My Dragons'!$F$6:$F$710,A8)","v":0}]
["Sea",1,"10s",0,0,0,0,{"$f":"COUNTIF('My Dragons'!$F$6:$F$710,A9)","v":0},{"$f":"IF((F9+F10)=0,0,(H9+H10)/(F9+F10))","v":{"v":0,"d":"0%"}},{"$f":"IF((H9+H10)=0,0,(H9+H10)/(G9+G10))","v":{"v":0,"d":"0%"}}]
["Big Sea",3,"2h",0,0,0,0,{"$f":"COUNTIF('My Dragons'!$F$6:$F$710,A10)","v":0}]
["Nature",2,"1h",0,0,0,0,{"$f":"COUNTIF('My Dragons'!$F$6:$F$710,A11)","v":0},{"$f":"IF((F11+F12)=0,0,(H11+H12)/(F11+F12))","v":{"v":0,"d":"0%"}},{"$f":"IF((H11+H12)=0,0,(H11+H12)/(G11+G12))","v":{"v":0,"d":"0%"}}]
["Big Nature",4,"2h",0,0,0,0,{"$f":"COUNTIF('My Dragons'!$F$6:$F$710,A12)","v":0}]
["Electric",2,"2h",0,0,0,0,{"$f":"COUNTIF('My Dragons'!$F$6:$F$710,A13)","v":0},{"$f":"IF((F13+F14)=0,0,(H13+H14)/(F13+F14))","v":{"v":0,"d":"0%"}},{"$f":"IF((H13+H14)=0,0,(H13+H14)/(G13+G14))","v":{"v":0,"d":"0%"}}]
["Big Electric",4,"8h",0,0,0,0,{"$f":"COUNTIF('My Dragons'!$F$6:$F$710,A14)","v":0}]
["Ice",1,"-",0,0,0,0,{"$f":"COUNTIF('My Dragons'!$F$6:$F$710,A15)","v":0},{"$f":"IF((F15+F16)=0,0,(H15+H16)/(F15+F16))","v":{"v":0,"d":"0%"}},{"$f":"IF((H15+H16)=0,0,(H15+H16)/(G15+G16))","v":{"v":0,"d":"0%"}}]
["Big Ice",3,"12h",0,0,0,0,{"$f":"COUNTIF('My Dragons'!$F$6:$F$710,A16)","v":0}]
["Metal",2,"-",0,0,0,0,{"$f":"COUNTIF('My Dragons'!$F$6:$F$710,A17)","v":0},{"$f":"IF((F17+F18)=0,0,(H17+H18)/(F17+F18))","v":{"v":0,"d":"0%"}},{"$f":"IF((H17+H18)=0,0,(H17+H18)/(G17+G18))","v":{"v":0,"d":"0%"}}]
["Big Metal",4,"18h",0,0,0,0,{"$f":"COUNTIF('My Dragons'!$F$6:$F$710,A18)","v":0}]
["Dark",2,"2h",0,0,0,0,{"$f":"COUNTIF('My Dragons'!$F$6:$F$710,A19)","v":0},{"$f":"IF((F19+F20)=0,0,(H19+H20)/(F19+F20))","v":{"v":0,"d":"0%"}},{"$f":"IF((H19+H20)=0,0,(H19+H20)/(G19+G20))","v":{"v":0,"d":"0%"}}]
["Big Dark",4,"30h",0,0,0,0,{"$f":"COUNTIF('My Dragons'!$F$6:$F$710,A20)","v":0}]
["Light",2,"4h",0,0,0,0,{"$f":"COUNTIF('My Dragons'!$F$6:$F$710,A21)","v":0},{"$f":"IF((F21+F22)=0,0,(H21+H22)/(F21+F22))","v":{"v":0,"d":"0%"}},{"$f":"IF((H21+H22)=0,0,(H21+H22)/(G21+G22))","v":{"v":0,"d":"0%"}}]
["Big Light",3,"24h",0,0,0,0,{"$f":"COUNTIF('My Dragons'!$F$6:$F$710,A22)","v":0}]
["War",2,"4h",0,0,0,0,{"$f":"COUNTIF('My Dragons'!$F$6:$F$710,A23)","v":0},{"$f":"IF((F23+F24)=0,0,(H23+H24)/(F23+F24))","v":{"v":0,"d":"0%"}},{"$f":"IF((H23+H24)=0,0,(H23+H24)/(G23+G24))","v":{"v":0,"d":"0%"}}]
["Big War",3,"36h",0,0,0,0,{"$f":"COUNTIF('My Dragons'!$F$6:$F$710,A24)","v":0}]
["Pure",2,"6h",0,0,0,0,{"$f":"COUNTIF('My Dragons'!$F$6:$F$710,A25)","v":0},{"$f":"IF(F25=0,0,H25/F25)","v":{"v":0,"d":"0%"}},{"$f":"IF(G25=0,0,H25/G25)","v":{"v":0,"d":"0%"}}]
["Legend",1,"8h",0,0,0,0,{"$f":"COUNTIF('My Dragons'!$F$6:$F$710,A26)","v":0},{"v":0,"d":"0%"},{"$f":"IF(G26=0,0,H26/G26)","v":{"v":0,"d":"0%"}}]
["Beauty",2,"5h",0,0,0,0,{"$f":"COUNTIF('My Dragons'!$F$6:$F$710,A27)","v":0},{"v":0,"d":"0%"},{"$f":"IF(G27=0,0,H27/G27)","v":{"v":0,"d":"0%"}}]
["Magic",2,"5h",0,0,0,0,{"$f":"COUNTIF('My Dragons'!$F$6:$F$710,A28)","v":0},{"v":0,"d":"0%"},{"$f":"IF(G28=0,0,H28/G28)","v":{"v":0,"d":"0%"}}]
["Chaos",2,"6h",0,0,0,0,{"$f":"COUNTIF('My Dragons'!$F$6:$F$710,A29)","v":0},{"v":0,"d":"0%"},{"$f":"IF(G29=0,0,H29/G29)","v":{"v":0,"d":"0%"}}]
["Happy",2,"6h",0,0,0,0,{"$f":"COUNTIF('My Dragons'!$F$6:$F$710,A30)","v":0},{"v":0,"d":"0%"},{"v":0,"d":"0%"}]
["Dream",2,"7h",0,0,0,0,{"$f":"COUNTIF('My Dragons'!$F$6:$F$710,A31)","v":0},{"v":0,"d":"0%"},{"v":0,"d":"0%"}]
["Soul",2,"8h",0,0,{"$f":"(D32+E32)*B32","v":0},0,{"$f":"COUNTIF('My Dragons'!$F$6:$F$710,A32)","v":0},{"v":0,"d":"0%"},{"v":0,"d":"0%"}]
["Dragonarium",1,"10h?",0,0,0,{"$f":"D33*B33","v":0},{"$f":"COUNTIF('My Dragons'!$F$6:$F$710,A33)","v":0},{"v":0,"d":"0%"},{"v":0,"d":"0%"}]
["Kindergarten",5,"?",0,0,0,{"$f":"D34*B34","v":0},null,{"v":0,"d":"0%"},{"$f":"IF(G34=0,0,H34/G34)","v":{"v":0,"d":"0%"}}]
[]
["Habitat Totals",null,null,{"$f":"SUM(D5:D32)","v":2},{"$f":"SUM(E5:E32)","v":0},{"$f":"SUM(F5:F32)","v":4},{"$f":"SUM(G5:G32)","v":4},{"$f":"SUM(H5:H32)","v":2},{"$f":"IF(F36=0,0,H36/F36)","v":{"v":0.5,"d":"50%"}},{"$f":"H36/G36","v":{"v":0.5,"d":"50%"}}]
["Storage Totals",{"$nulls":4},{"$f":"F33+F34","v":0},{"$f":"G33+G34","v":0},{"$f":"H33+H34","v":0},{"$f":"IF(F37=0,0,H37/F37)","v":{"v":0,"d":"0%"}},{"$f":"IF(G37=0,0,H37/G37)","v":{"v":0,"d":"0%"}}]
["Grand Total",{"$nulls":4},{"$f":"F36+F37","v":4},{"$f":"G36+G37","v":4},2,{"$f":"IF(F38=0,0,H38/F38)","v":{"v":0.5,"d":"50%"}},{"$f":"H38/G38","v":{"v":0.5,"d":"50%"}}]

{"sheet":"Tables","index":3,"n_rows":730,"n_cols":25,"rows_kept":730,"merged":[[1,11,1,14],[1,15,1,22]]}
[]
[{"$nulls":11},"Habitat",{"$nulls":3},"Attack"]
["Attack","Element","Damage",null,"Elements",null,"Attack Element",null,"Number","Dragon","Category",1,2,3,4,1,2,3,4,"T1","T2","T3","T4","Breedable","Breed/Hatch"]
["Acid Rain","Sea",1200,null,"Beauty",null,"Beauty",null,1,"Abyss",5,"Light","Dark","Ice","Flame","Light Sword","Ghost Cloud","Frost Nova","Nuclear Hit","Enlightning Wisdom","The Grim Reaper","Icy Wind","Magma Storm",1,"62/72"]
["Appeal","Happy",1350,null,"Chaos",null,"Chaos",null,2,"Ace",4,"Sea","Nature","Metal",null,"Judo Kick","Flooding","Stitching Roots","Nail Rain","Hammer Fist","Acid Rain","Rottening Spell","Cannon Balls",0,23]
["Asteroid","Terra",1200,null,"Dark",null,"Dark",null,3,"Acoustic",4,"Dark","Electric",null,null,"Punch","Life Drain","Electric Shock","Leech","The Grim Reaper","Electro Ball","Black Hole","Tesla Ray",1,"58/68"]
["Astro Hit","War",1650,null,"Dream",null,"Dream",null,4,"Adamantium",4,"Metal","Terra",null,null,"Stunning Hit","Nail Rain","Magneto","Tumble Weed","Hammer Fist","Cannon Balls","Ninja Stars","Sand Storm",0,16]
["Aurora Borealis","Legend",2100,null,"Electric",null,"Electric",null,5,"Adventure",4,"Terra","Flame","Light",null,"Stunning Hit","Tumble Weed","Flaming Arrows","Light Prism","Karate Brick Break","Sand Storm","Magma Storm","Light Star",0,23]
["Bee Hive","Nature",1350,null,"Flame",null,"Flame",null,6,"Albino",4,"Sea","Nature","Light",null,"Hard Charge","Flooding","Poison Ivy","Light Prism","Hammer Fist","Acid Rain","Rottening Spell","Enlightning Wisdom",0,23]
["Black Hole","Dark",1350,null,"Happy",null,"Happy",null,7,"Alien",4,"Sea","Metal",null,null,"Stunning Hit","Storm","Judo Kick","Rust","Acid Rain","Hammer Fist","Ninja Stars","Karate Brick Break",0,15]
["Bright Aura","Beauty",1175,null,"Ice",null,"Ice",null,8,"Allure",5,"Light ","Nature",null,null,"Head Butt","Light Sword","Light Prism","Poison Ivy","Deus Sword","Enlightning Wisdom","Out of Time","Bee Hive",0,23]
["Brilliant Firework","Happy",1050,null,"Legend",null,"Legend",null,9,"Alpine",2,"Terra","Ice",null,null,"Flying Kick","Ice Spikes","Stunning Hit","Tumble Weed","Head Butt","Asteroid","Icy Wind","Sand Storm",1,"13/19"]
["Cannon Balls","Metal",1200,null,"Light",null,"Light",null,10,"Amazone",4,"Metal","Dark","Nature",null,"Hard Charge","Cannon Balls","Ghost Cloud","Stitching Roots","Stunning Hit","Ninja Stars","The Grim Reaper","Leaf Blast",0,23]
["Celestial Hand","Soul",1050,null,"Magic",null,"Magic",null,11,"Amber",4,"Beauty","Soul",null,null,"Judo Kick","Floral Coup","Soul Breaker","Bright Aura","Karate Brick Break","Deus Sword","Grace Touch","Supernatural",1,"16/24"]
["Confusing Wake","Dream",1050,null,"Metal",null,"Metal",null,12,"Amerindian",6,"Nature","Terra","Pure",null,"Punch","Stitching Roots","Earthquake","Pure Energy","Hammer Fist","Poison Ivy","Meteor Shower","Pure Light",0,"23"]
["Cryogenic Freeze","Ice",1350,null,"Nature",null,"Nature",null,13,"Amethyst",4,"Nature","Metal",null,null,"Flying Kick","Stitching Roots","Head Butt","Rust","Hammer Fist","Bee Hive","Karate Brick Break","Cannon Balls",0,17]
["Destiny Chains","Chaos",1175,null,"Pure",null,"Physical",null,14,"Ancient",4,"Terra","Ice","Nature",null,"Punch","Lightning","Snow Storm","Leaf Blast","Deus Sword","Electro Ball","Cryogenic Freeze","Rottening Spell",0,17]
["Deus Sword","Physical",1125,null,"Sea",null,"Pure",null,15,"Angry",4,"Terra","Flame","Nature",null,"Stunning Hit","Earthquake","Leaf Blast","Nuclear Hit","Hammer Fist","Asteroid","Flamethrower","Rottening Spell",1,"16/24"]
["Disorder","Chaos",1350,null,"Soul",null,"Sea",null,16,"Animation",4,"Sea","Electric",null,null,"Punch","Tsunami","Judo Kick","Lightning","Acid Rain","Electro Ball","Whirlpool","Tesla Ray",0,17]
["Earthquake","Terra",550,null,"Terra",null,"Soul",null,17,"Anniversary",4,"Sea","Nature","Flame",null,"Punch","Flooding","Leaf Blast","Lava Balls","Hammer Fist","Whirlpool","Rottening Spell","Flamethrower",0,23]
["Electric Shock","Electric",1050,null,"War",null,"Terra",null,18,"Anubis",4,"Dark","Terra",null,null,"Flying Kick","Life Drain","Earthquake","Leech","Stunning Hit","Ghost Cloud","Asteroid","The Grim Reaper",0,23]
["Electro Ball","Electric",1200,{"$nulls":3},"War",null,19,"Apache",3,"Sea","Terra",null,null,"Hard Charge","Flooding","Storm","Tumble Weed","Hammer Fist","Acid Rain","Whirlpool","Sand Storm",0,17]
["Enlightning Wisdom","Light",1200,{"$nulls":5},20,"Apocalypse",5,"Flame","Ice","Light","Dark","Nuclear Hit","Snow Storm","Light Prism","Ghost Cloud","Flamethrower","Icy Wind","Out of Time","Black Hole",1,"62/72"]
["Festive Lights","Happy",1175,{"$nulls":5},21,"Aqualung",5,"Terra","Metal","Sea",null,"Stunning Hit","Meteor Shower","Magneto","Storm","Hammer Fist","Asteroid","Ninja Stars","Whirlpool",0,16]
["Flamethrower","Flame",1200,{"$nulls":5},22,"Aquamarine",4,"Sea","Nature",null,null,"Punch","Tsunami","Flooding","Leaf Blast","Karate Brick Break","Acid Rain","Whirlpool","Rottening Spell",0,23]
["Flaming Arrows","Flame",650,{"$nulls":5},23,"Archangel",4,"Light",{"$nulls":3},"Punch","Light Prism","Head Butt","Light Sword","Karate Brick Break","Enlightning Wisdom","Deus Sword","Out of Time",1,"5/7"]
["Flooding","Sea",650,{"$nulls":5},24,"Armadillo",4,"Terra","Metal",null,null,"Stunning Hit","Meteor Shower","Rust","Tumble Weed","Judo Kick","Asteroid","Ninja Stars","Cannon Balls",1,"9/15"]
["Floral Coup","Beauty",1050,null,"Ancient Elements",{"$nulls":3},25,"Asier",5,"Legend",{"$nulls":3},"Hard Charge","Legendary Wind","Head Butt","Paralyzing Spell","Hammer Fist","Rainbow","Deus Sword","Legend Spell",1,"50/58"]
["Flying Kick","Physical",413,null,"Beauty",{"$nulls":3},26,"Astronaut",4,"Electric","Metal","Light",null,"Hard Charge","Lightning","Magneto","Light Star","Deus Sword","Electro Ball","Cannon Balls","Out of Time",0,23]
["Frost Nova","Ice",550,null,"Chaos",{"$nulls":3},27,"Atlantean",5,"Legend",{"$nulls":3},"Judo Kick","Legendary Wind","Paralyzing Spell","Rainbow","Karate Brick Break","Deus Sword","Aurora Borealis","Legend Spell",0,16]
["Ghost Cloud","Dark",1050,null,"Dream",{"$nulls":3},28,"Atlas",4,"Sea","Terra","Nature",null,"Judo Kick","Storm","Meteor Shower","Leaf Blast","Karate Brick Break","Acid Rain","Asteroid","Rottening Spell",0,17]
["Ghostly Blades","Soul",1200,null,"Happy",{"$nulls":3},29,"Aurora",4,"Electric","Flame",null,null,"Hard Charge","Laser Beam","Stunning Hit","Nuclear Hit","Head Butt","Electric Shock","Judo Kick","Flamethrower",1,"16/24"]
["Giant Claw","War",1050,null,"Magic",{"$nulls":3},30,"Aztec",4,"Terra","Flame",null,null,"Hard Charge","Flaming Arrows","Stunning Hit","Tumble Weed","Head Butt","Nuclear Hit","Karate Brick Break","Asteroid",1,"16/24"]
["Giant Crack","War",638,null,"Soul",{"$nulls":3},31,"Aztec Emperor",4,"Nature","Electric","Light",null,"Stunning Hit","Stitching Roots","Electric Shock","Light Star","Deus Sword","Bee Hive","Electro Ball","Pure Light",0,17]
["Giant Mouth","War",975,{"$nulls":5},32,"Aztec Priest",4,"Nature","Dark",null,null,"Flying Kick","Leaf Blast","Stunning Hit","Leech","Hammer Fist","Bee Hive","Karate Brick Break","Black Hole",0,17]
["Grace Touch","Beauty",1350,{"$nulls":5},33,"Aztec Warrior",4,"Nature","Flame",null,null,"Punch","Poison Ivy","Hard Charge","Flaming Arrows","Hammer Fist","Rottening Spell","Karate Brick Break","Flamethrower",0,17]
["Hammer Fist","Physical",900,{"$nulls":5},34,"Balloon",3,"Happy","Dream",null,null,"Head Butt","Brilliant Firework","Confusing Wake","Festive Lights","Karate Brick Break","Deus Sword","Appeal","Trance",1,"16/24"]
["Hard Charge","Physical",488,{"$nulls":5},35,"Barley",4,"Sea","Terra","Light",null,"Stunning Hit","Acid Rain","Tumble Weed","Light Sword","Hammer Fist","Whirlpool","Sand Storm","Enlightning Wisdom",0,23]
["Head Butt","Physical",788,{"$nulls":5},36,"Basilisk",5,"Flame","Pure",null,null,"Stunning Hit","Lava Balls","Pure Energy","Nuclear Hit","Flamethrower","Hypnosis","Magma Storm","Pure Light",1,"58/68"]
["Hypnosis","Pure",1500,{"$nulls":5},37,"Bastark",4,"Ice","Metal","Light",null,"Punch","Frost Nova","Rust","Enlightning Wisdom","Judo Kick","Snow Storm","Ninja Stars","Out of Time",0,17]
["Ice Spikes","Ice",650,{"$nulls":5},38,"Bat",4,"Dark","Terra",null,null,"Stunning Hit","Meteor Shower","Head Butt","Ghost Cloud","Judo Kick","Asteroid","Hammer Fist","The Grim Reaper",1,"16/24"]
["Icy Wind","Ice",1200,{"$nulls":5},39,"Battery",2,"Electric","Metal",null,null,"Flying Kick","Lightning","Magneto","Laser Beam","Head Butt","Electric Shock","Rust","Electro Ball",1,"13/19"]
["Infernal Crack","Chaos",1050,{"$nulls":5},40,"Bavarian",4,"Terra","Ice",null,null,"Hard Charge","Earthquake","Stunning Hit","Snow Storm","Hammer Fist","Asteroid","Karate Brick Break","Icy Wind",0,17]
["Judo Kick","Physical",863,{"$nulls":5},41,"Beholder",5,"War","Pure","Ice","Dark","Giant Claw","Hypnosis","Icy Wind","The Grim Reaper","War Fist","Pure Light","Cryogenic Freeze","Black Hole",0,40]
["Karate Brick Break","Physical",1013,{"$nulls":5},42,"Big Claws",4,"Metal","Flame","Electric",null,"Head Butt","Magneto","Nuclear Hit","Electric Shock","Karate Brick Break","Cannon Balls","Flamethrower","Tesla Ray",0,17]
["Laser Beam","Electric",650,{"$nulls":5},43,"Big Hat",4,"Electric","Ice",null,null,"Stunning Hit","Electric Shock","Head Butt","Ice Spikes","Hammer Fist","Electro Ball","Icy Wind","Tesla Ray",0,17]
["Lava Balls","Flame",550,{"$nulls":5},44,"BigFace",4,"Electric","Ice","Metal",null,"Hammer Fist","Laser Beam","Frost Nova","Nail Rain","Deus Sword","Electric Shock","Icy Wind","Cannon Balls",0,23]
["Leaf Blast","Nature",1050,{"$nulls":5},45,"Black Knight",4,"Dark","Flame",null,null,"Hard Charge","Life Drain","Stunning Hit","Lava Balls","The Grim Reaper","Flamethrower","Black Hole","Magma Storm",0,17]
["Leech","Dark",650,{"$nulls":5},46,"Black Swan",4,"Dark","Sea","Pure",null,"Head Butt","Leech","Flooding","Hypnosis","Karate Brick Break","The Grim Reaper","Acid Rain","Pure Energy",0,24]
["Legend Spell","Legend",2300,{"$nulls":5},47,"Blind",3,"Terra","Dark",null,null,"Stunning Hit","Earthquake","Head Butt","Life Drain","Hammer Fist","Asteroid","Karate Brick Break","Black Hole",0,17]
["Legendary Wind","Legend",550,{"$nulls":5},48,"Blizzard",3,"Sea","Flame",null,null,"Hard Charge","Flaming Arrows","Flooding","Nuclear Hit","Head Butt","Magma Storm","Acid Rain","Flamethrower",1,"2/2"]
["Life Drain","Dark",550,{"$nulls":5},49,"Block",4,"Electric","Dark",null,null,"Stunning Hit","Laser Beam","Head Butt","Ghost Cloud","Hammer Fist","Electric Shock","Karate Brick Break","The Grim Reaper",1,"9/15"]
["Light Prism","Light",750,{"$nulls":5},50,"Blue",4,"Sea","Flame","Metal",null,"Storm","Head Butt","Rust","Nuclear Hit","Acid Rain","Hammer Fist","Cannon Balls","Magma Storm",1,"11/17"]
["Light Star","Light",1050,{"$nulls":5},51,"Blue Alien",5,"Pure","Light","Sea",null,"Punch","Hypnosis","Light Prism","Tsunami","Flying Kick","Pure Light","Out of Time","Acid Rain",0,40]
["Light Sword","Light",650,{"$nulls":5},52,"Blue Fire",4,"Flame","Ice","Pure",null,"Hard Charge","Flaming Arrows","Stunning Hit","Ice Spikes","Hammer Fist","Magma Storm","Cryogenic Freeze","Pure Energy",0,17]
["Lightning","Electric",550,{"$nulls":5},53,"Bohemian",5,"Legend",{"$nulls":3},"Punch","Legendary Wind","Stunning Hit","Rainbow","Hammer Fist","Aurora Borealis","Karate Brick Break","Legend Spell",0,"23"]
["Magic Blow","Magic",1050,{"$nulls":5},54,"Bone",4,"Dark","Terra",null,null,"Punch","Leech","Hard Charge","Tumble Weed","Hammer Fist","The Grim Reaper","Deus Sword","Sand Storm",0,17]
["Magma Storm","Flame",1350,{"$nulls":5},55,"Bonfire",4,"Flame","Terra","Nature",null,"Flying Kick","Flaming Arrows","Meteor Shower","Leaf Blast","Head Butt","Nuclear Hit","Asteroid","Bee Hive",0,"23"]
["Magneto","Metal",650,{"$nulls":5},56,"Bookday",4,"Nature","Flame","Pure",null,"Stunning Hit","Stitching Roots","Flaming Arrows","Hypnosis","Deus Sword","Bee Hive","Magma Storm","Pure Light",0,23]
["Mana Lightnings","Magic",1175,{"$nulls":5},57,"Boreal",4,"Pure","Dark","Light",null,"Judo Kick","Hypnosis","Life Drain","Light Prism","Hammer Fist","Pure Energy","Ghost Cloud","Enlightning Wisdom",0,"40"]
["Meteor Shower","Terra",650,{"$nulls":5},58,"Box",5,"Dark","Terra",null,null,"Stunning Hit","Leech","Poison Ivy","Ghost Cloud","Karate Brick Break","The Grim Reaper","Rottening Spell","Black Hole",0,23]
["Nail Rain","Metal",550,{"$nulls":5},59,"Brave Sword",4,"Terra","Sea","War",null,"Head Butt","Meteor Shower","Storm","Giant Claw","Deus Sword","Asteroid","Whirlpool","War Fist",0,23]
["Ninja Stars","Metal",1350,{"$nulls":5},60,"Bride",3,"Beauty","Happy",null,null,"Stunning Hit","Brilliant Firework","Floral Coup","Festive Lights","Karate Brick Break","Deus Sword","Appeal","Grace Touch",1,"16/24"]
["Nuclear Hit","Flame",1050,{"$nulls":5},61,"Brontosaurus",4,"Nature","Terra",null,null,"Hard Charge","Meteor Shower","Head Butt","Leaf Blast","Head Butt","Tumble Weed","Hammer Fist","Bee Hive",0,15]
["Out of Time","Light",1350,{"$nulls":5},62,"Bunny",4,"Nature","Terra","Pure",null,"Stunning Hit","Poison Ivy","Tumble Weed","Hypnosis","Hammer Fist","Rottening Spell","Asteroid","Pure Light",0,23]
["Paralyzing Spell","Legend",650,{"$nulls":5},63,"Burning",4,"Flame","Dark",null,null,"Hard Charge","Flaming Arrows","Head Butt","Life Drain","Hammer Fist","Magma Storm","Deus Sword","The Grim Reaper",1,17]
["Poison Ivy","Nature",650,{"$nulls":5},64,"Bushido",7,"Metal","Dark","Pure","War","Magneto","The Grim Reaper","Giant Mouth","Pure Energy","Rust","Black Hole","Astro Hit","Pure Light",0,"23"]
["Poisonous Dream","Dream",1175,{"$nulls":5},65,"Butterfly",3,"Nature","Flame",null,null,"Hard Charge","Poison Ivy","Head Butt","Nuclear Hit","Judo Kick","Leaf Blast","Hammer Fist","Flamethrower",1,"9/15"]
["Punch","Physical",338,{"$nulls":5},66,"Cactus",3,"Terra","Nature",null,null,"Hard Charge","Meteor Shower","Head Butt","Leaf Blast","Head Butt","Tumble Weed","Hammer Fist","Bee Hive",1,"7/9"]
["Pure Energy","Pure",1500,{"$nulls":5},67,"Car",4,"Metal","Sea","War",null,"Stunning Hit","Nail Rain","Flooding","Giant Claw","Karate Brick Break","Cannon Balls","Acid Rain","War Fist",0,23]
["Pure Light","Pure",1500,{"$nulls":5},68,"Carnival",4,"Metal","Flame",null,null,"Hard Charge","Magneto","Stunning Hit","Nuclear Hit","Judo Kick","Rust","Hammer Fist","Flamethrower",1,"16/24"]
["Rainbow","Legend",1050,{"$nulls":5},69,"Carnivore Plant",2,"Nature","Dark",null,null,"Flying Kick","Stitching Roots","Poison Ivy","Leech","Stunning Hit","Leaf Blast","Rottening Spell","The Grim Reaper",1,"13/19"]
["Rottening Spell","Nature",1200,{"$nulls":5},70,"Cat",4,"Flame","Dark",null,null,"Flying Kick","Flaming Arrows","Judo Kick","Life Drain","Flamethrower","The Grim Reaper","Magma Storm","Black Hole",0,17]
["Rust","Metal",1050,{"$nulls":5},71,"Celtic",3,"Light","Nature","Terra",null,"Hard Charge","Light Sword","Stitching Roots","Tumble Weed","Hammer Fist","Out of Time","Bee Hive","Asteroid",0,16]
["Sand Storm","Terra",1350,{"$nulls":5},72,"Centipede",4,"Nature","Terra",null,null,"Hard Charge","Meteor Shower","Head Butt","Leaf Blast","Head Butt","Tumble Weed","Hammer Fist","Bee Hive",1,"16/24"]
["Snow Storm","Ice",1050,{"$nulls":5},73,"Cerberus",4,"Dark","Flame","Terra",null,"Punch","Leech","Lava Balls","Meteor Shower","Hammer Fist","The Grim Reaper","Magma Storm","Asteroid",0,17]
["Soul Breaker","Soul",1175,{"$nulls":5},74,"Chainmail",4,"Metal","Flame",null,null,"Stunning Hit","Flaming Arrows","Karate Brick Break","Nail Rain","Flamethrower","Magma Storm","Cannon Balls","Ninja Stars",0,17]
["Stitching Roots","Nature",550,{"$nulls":5},75,"Chakra",4,"Magic","Soul",null,null,"Stunning Hit","Magic Blow","Soul Breaker","Mana Lightnings","Karate Brick Break","Deus Sword","Vigor Feel","Supernatural",1,"16/24"]
["Storm","Sea",1050,{"$nulls":5},76,"Chameleon",3,"Terra","Electric",null,null,"Hard Charge","Meteor Shower","Head Butt","Electric Shock","Head Butt","Tumble Weed","Karate Brick Break","Electro Ball",1,"9/15"]
["Stunning Hit","Physical",638,{"$nulls":5},77,"Cheshire Cat",4,"Electric","Metal","Dark",null,"Flying Kick","Lightning","Nail Rain","Ghost Cloud","Hammer Fist","Electro Ball","Cannon Balls","The Grim Reaper",0,23]
["Supernatural","Soul",1350,{"$nulls":5},78,"Chicken",4,"Electric","Nature","Light",null,"Judo Kick","Electric Shock","Stitching Roots","Light Sword","Deus Sword","Tesla Ray","Leaf Blast","Light Prism",0,23]
["Tesla Ray","Electric",1350,{"$nulls":5},79,"Chimera",4,"Flame","Light",null,null,"Flying Kick","Nuclear Hit","Head Butt","Light Prism","Flamethrower","Deus Sword","Magma Storm","Out of Time",0,17]
["The Grim Reaper","Dark",1200,{"$nulls":5},80,"Chinese",4,"Flame","Terra",null,null,"Stunning Hit","Meteor Shower","Head Butt","Nuclear Hit","Judo Kick","Tumble Weed","Karate Brick Break","Flamethrower",0,15]
["Trance","Dream",1350,{"$nulls":5},81,"Chobby",4,"Ice","Metal",null,null,"Head Butt","Frost Nova","Stunning Hit","Magneto","Icy Wind","Cannon Balls","Cryogenic Freeze","Ninja Stars",0,17]
["Tsunami","Sea",550,{"$nulls":5},82,"Chocolate",4,"Dark","Nature","War",null,"Hard Charge","Leech","Leaf Blast","Giant Claw","Deus Sword","Black Hole","Bee Hive","War Fist",0,23]
["Tumble Weed","Nature",1050,{"$nulls":5},83,"Christreen",5,"Nature","Terra","Light",null,"Hard Charge","Stitching Roots","Meteor Shower","Light Prism","Karate Brick Break","Rottening Spell","Asteroid","Enlightning Wisdom",0,23]
["Vigor Feel","Magic",1350,{"$nulls":5},84,"Chrome",3,"Metal","Ice",null,null,"Hard Charge","Magneto","Ice Spikes","Rust","Head Butt","Cannon Balls","Snow Storm","Ninja Stars",0,17]
["War Fist","War",1500,{"$nulls":5},85,"Citadel",5,"War","Light",null,null,"Hard Charge","Giant Crack","Giant Mouth","Light Star","Karate Brick Break","Astro Hit","War Fist","Enlightning Wisdom",0,23]
["Whirlpool","Sea",1350,{"$nulls":5},86,"Clay",4,"Flame","Nature","War",null,"Judo Kick","Light Prism","Meteor Shower","Giant Mouth","Karate Brick Break","Enlightning Wisdom","Asteroid","Whirlpool",0,16]
[{"$nulls":8},87,"Cloud",2,"Flame","Sea",null,null,"Flying Kick","Lava Balls","Flooding","Flaming Arrows","Stunning Hit","Nuclear Hit","Acid Rain","Nuclear Hit",1,"5/7"]
[{"$nulls":8},88,"Clover",4,"Nature","Ice",null,null,"Punch","Leaf Blast","Head Butt","Ice Spikes","Deus Sword","Bee Hive","Cryogenic Freeze","Asteroid",0,17]
[{"$nulls":8},89,"Cold Star",4,"Light","Ice",null,null,"Hard Charge","Light Star","Snow Storm","Frost Nova","Out of Time","Icy Wind","Enlightning Wisdom","Cryogenic Freeze",1,"20/28"]
[{"$nulls":8},90,"Colossal",4,"War","Terra",null,null,"Stunning Hit","Giant Claw","Judo Kick","Earthquake","Hammer Fist","War Fist","Deus Sword","Sand Storm",1,"32/40"]
[{"$nulls":8},91,"Columbus",4,"Terra","Sea",null,null,"Hard Charge","Earthquake","Stunning Hit","Flooding","Hammer Fist","Sand Storm","Karate Brick Break","Whirlpool",0,17]
[{"$nulls":8},92,"Cookie",4,"Nature","Terra",null,null,"Hard Charge","Stitching Roots","Stunning Hit","Meteor Shower","Hammer Fist","Bee Hive","Karate Brick Break","Sand Storm",0,17]
[{"$nulls":8},93,"Cool Fire",4,"Flame","Ice",null,null,"Stunning Hit","Ice Spikes","Flaming Arrows","Snow Storm","Judo Kick","Cryogenic Freeze","Flamethrower","Magma Storm",1,"9/15"]
[{"$nulls":8},94,"Coral",3,"Nature","Sea",null,null,"Hard Charge","Flooding","Stunning Hit","Leaf Blast","Head Butt","Storm","Judo Kick","Bee Hive",1,"9/15"]
[{"$nulls":8},95,"Core",4,"Light","Pure",null,null,"Stunning Hit","Light Prism","Pure Energy","Light Star","Enlightning Wisdom","Hypnosis","Out of Time","Pure Light",1,"58/68"]
[{"$nulls":8},96,"Cosmo",4,"Terra","Electric",null,null,"Flying Kick","Meteor Shower","Stunning Hit","Electric Shock","Hammer Fist","Asteroid","Deus Sword","Electro Ball",0,17]
[{"$nulls":8},97,"Cow",8,"Light","Metal","Pure",null,"Judo Kick","Light Prism","Nail Rain","Pure Energy","Karate Brick Break","Out of Time","Ninja Stars","Pure Light",0,23]
[{"$nulls":8},98,"Crest",4,"Electric","Terra","Nature",null,"Karate Brick Break","Laser Beam","Earthquake","Leaf Blast","Deus Sword","Tesla Ray","Tumble Weed","Rottening Spell",0,"17"]
[{"$nulls":8},99,"Crossfire",3,"Flame","Terra","Electric",null,"Hard Charge","Flaming Arrows","Meteor Shower","Lightning","Hammer Fist","Magma Storm","Asteroid","Tesla Ray",0,17]
[{"$nulls":8},100,"Cruel",9,"Legend","Chaos","Dark",null,"Punch","Paralyzing Spell","Infernal Crack","Life Drain","Flying Kick","Rainbow","Destiny Chains","The Grim Reaper",0,58]
[{"$nulls":8},101,"Crystal",5,"Legend",{"$nulls":3},"Head Butt","Legendary Wind","Paralyzing Spell","Rainbow","Karate Brick Break","Deus Sword","Aurora Borealis","Legend Spell",1,"50/58"]
[{"$nulls":8},102,"Cyborg",4,"Metal","Dark","War",null,"Head Butt","Magneto","Life Drain","Giant Mouth","Deus Sword","Cannon Balls","The Grim Reaper","Astro Hit",0,23]
[{"$nulls":8},103,"Cyclops",4,"Terra","Flame","War",null,"Head Butt","Meteor Shower","Nuclear Hit","Giant Mouth","Karate Brick Break","Sand Storm","Magma Storm","Astro Hit",0,23]
[{"$nulls":8},104,"Da Vinci",4,"Nature","Light","Pure",null,"Hard Charge","Poison Ivy","Light Sword","Pure Energy","Deus Sword","Bee Hive","Light Star","Pure Energy",0,23]
[{"$nulls":8},105,"Dainty",4,"Ice","Terra","Nature",null,"Punch","Frost Nova","Tumble Weed","Poison Ivy","Hammer Fist","Icy Wind","Asteroid","Leaf Blast",0,23]
[{"$nulls":8},106,"Dandelion",2,"Nature","Ice",null,null,"Flying Kick","Stitching Roots","Ice Spikes","Poison Ivy","Hard Charge","Leaf Blast","Snow Storm","Rottening Spell",1,"9/15"]
[{"$nulls":8},107,"Dark",1,"Dark",{"$nulls":3},"Punch","Life Drain","Stunning Hit","Leech","Hard Charge","Ghost Cloud","Head Butt","The Grim Reaper",1,"2/2"]
[{"$nulls":8},108,"Dark Angel",5,"Light","Pure",null,null,"Judo Kick","Light Prism","Leech","Hypnosis","Magma Storm","Out of Time","Black Hole","Pure Light",0,23]
[{"$nulls":8},109,"Dark Elf",4,"Dark","Ice","War",null,"Stunning Hit","Leech","Snow Storm","Giant Claw","Hammer Fist","The Grim Reaper","Icy Wind","Astro Hit",1,"58/68"]
[{"$nulls":8},110,"Dark Fire",3,"Dark","Flame",null,null,"Hard Charge","Leech","Nuclear Hit","Ghost Cloud","Judo Kick","The Grim Reaper","Magma Storm","Black Hole",1,"9/15"]
[{"$nulls":8},111,"Dark Jaws",5,"Flame","War","Dark","Light","Nuclear Hit","Ghost Cloud","Giant Claw","Light Star","Magma Storm","Black Hole","War Fist","Out of Time",0,16]
[{"$nulls":8},112,"Dark Lord",8,"Legend","Dark",null,null,"Hammer Fist","Legendary Wind","The Grim Reaper","Paralyzing Spell","Karate Brick Break","Aurora Borealis","Black Hole","Legend Spell",0,"23"]
[{"$nulls":8},113,"Dark Stone",4,"War","Dark",null,null,"Punch","Giant Crack","Stunning Hit","Leech","Astro Hit","The Grim Reaper","War Fist","Black Hole",1,"32/40"]
[{"$nulls":8},114,"Deep Forest",4,"Nature","Terra",null,null,"Hard Charge","Meteor Shower","Head Butt","Leaf Blast","Head Butt","Tumble Weed","Hammer Fist","Bee Hive",1,"16/24"]
[{"$nulls":8},115,"Deep Red",4,"Flame","Metal","Dark",null,"Judo Kick","Nuclear Hit","Life Drain","Nail Rain","Hammer Fist","Flamethrower","Black Hole","Cannon Balls",1,17]
[{"$nulls":8},116,"Deja Vu",4,"Flame","Electric","War",null,"Hammer Fist","Lava Balls","Lightning","Giant Mouth","Deus Sword","Flamethrower","Laser Beam","Giant Claw",0,"23"]
[{"$nulls":8},117,"Demigod",5,"Legend","War","Light",null,"Judo Kick","Paralyzing Spell","Giant Mouth","Light Sword","Deus Sword","Rainbow","Astro Hit","Out of Time",0,"17"]
[{"$nulls":8},118,"Demon",4,"Dark","Flame","Metal",null,"Stunning Hit","Leech","Flaming Arrows","Rust","Hammer Fist","The Grim Reaper","Magma Storm","Cannon Balls",0,17]
[{"$nulls":8},119,"Depth",4,"Dark","War","Metal",null,"Judo Kick","Leech","Giant Mouth","Rust","Deus Sword","The Grim Reaper","War Fist","Ninja Stars",0,16]
[{"$nulls":8},120,"Desert",4,"Terra","Flame","Electric",null,"Hard Charge","Earthquake","Lava Balls","Lightning","Hammer Fist","Sand Storm","Flamethrower","Electro Ball",0,23]
[{"$nulls":8},121,"Detective",4,"Terra","Sea","Dark",null,"Flying Kick","Earthquake","Flooding","Ghost Cloud","Hammer Fist","Asteroid","Whirlpool","Black Hole",0,23]
[{"$nulls":8},122,"Deus Pet",4,"Terra","Flame",null,null,"Flying Kick","Earthquake","Flaming Arrows","Meteor Shower","Stunning Hit","Tumble Weed","Nuclear Hit","Asteroid",0,"1m"]
[{"$nulls":8},123,"Diamond",4,"Ice","Terra","Nature",null,"Hard Charge","Ice Spikes","Earthquake","Stitching Roots","Deus Sword","Icy Wind","Asteroid","Rottening Spell",1,"16/24"]
[{"$nulls":8},124,"Dolphin",4,"Sea","Light",null,null,"Stunning Hit","Flooding","Head Butt","Light Star","Acid Rain","Enlightning Wisdom","Whirlpool","Out of Time",0,23]
[{"$nulls":8},125,"Double Electric",4,"Electric","Electric",null,null,"Hard Charge","Laser Beam","Punch","Electric Shock","Hammer Fist","Electro Ball","Karate Brick Break","Tesla Ray",0,13]
[{"$nulls":8},126,"Double Flame",4,"Flame","Flame",null,null,"Hard Charge","Flaming Arrows","Stunning Hit","Nuclear Hit","Deus Sword","Flamethrower","Hammer Fist","Magma Storm",0,"30s"]
[{"$nulls":8},127,"Double Ice",4,"Ice","Ice",null,null,"Stunning Hit","Ice Spikes","Head Butt","Snow Storm","Deus Sword","Icy Wind","Karate Brick Break","Cryogenic Freeze",0,15]
[{"$nulls":8},128,"Double Metal",4,"Metal","Metal",null,null,"Judo Kick","Nail Rain","Flying Kick","Magneto","Hammer Fist","Cannon Balls","Deus Sword","Ninja Stars",0,13]
[{"$nulls":8},129,"Double Nature",4,"Nature","Nature",null,null,"Flying Kick","Stitching Roots","Head Butt","Leaf Blast","Karate Brick Break","Rottening Spell","Deus Sword","Bee Hive",0,13]
[{"$nulls":8},130,"Double Sea",4,"Sea","Sea",null,null,"Head Butt","Tsunami","Judo Kick","Storm","Karate Brick Break","Acid Rain","Hammer Fist","Whirlpool",0,"5m"]
[{"$nulls":8},131,"Double Terra",4,"Terra","Terra",null,null,"Punch","Earthquake","Flying Kick","Meteor Shower","Hammer Fist","Asteroid","Karate Brick Break","Sand Storm",0,"15s"]
[{"$nulls":8},132,"Dragonfly",3,"Nature","Metal",null,null,"Hard Charge","Poison Ivy","Head Butt","Nail Rain","Head Butt","Rottening Spell","Karate Brick Break","Rust",1,"13/19"]
[{"$nulls":8},133,"Dragotron",5,"Legend",{"$nulls":3},"Head Butt","Legendary Wind","Judo Kick","Paralyzing Spell","Hammer Fist","Aurora Borealis","Deus Sword","Legend Spell",0,58]
[{"$nulls":8},134,"Dreamcatcher",8,"Dream","Soul",null,null,"Judo Kick","Confusing Wake","Soul Breaker","Poisonous Dream","Karate Brick Break","Deus Sword","Trance","Supernatural",1,"16/24"]
[{"$nulls":8},135,"Droconos",5,"Legend",{"$nulls":3},"Stunning Hit","Legendary Wind","Head Butt","Rainbow","Karate Brick Break","Aurora Borealis","Deus Sword","Legend Spell",1,"50/58"]
[{"$nulls":8},136,"Dual",5,"Legend",{"$nulls":3},"Flying Kick","Legendary Wind","Hard Charge","Paralyzing Spell","Stunning Hit","Rainbow","Karate Brick Break","Aurora Borealis",0,"58"]
[{"$nulls":8},137,"Dujur",5,"Flame","Electric","Ice",null,"Hard Charge","Frost Nova","Electric Shock","Nuclear Hit","Judo Kick","Cryogenic Freeze","Electro Ball","Flamethrower",1,"9/15"]
[{"$nulls":8},138,"Earth Day",4,"Terra","Nature","Light",null,"Head Butt","Earthquake","Stitching Roots","Light Star","Hammer Fist","Bee Hive","Deus Sword","Light Prism",0,23]
[{"$nulls":8},139,"Easter",4,"Terra","Light","Nature",null,"Head Butt","Earthquake","Light Star","Leaf Blast","Karate Brick Break","Sand Storm","Enlightning Wisdom","Rottening Spell",0,23]
[{"$nulls":8},140,"Eclipse",4,"Sea","Dark","Light",null,"Hard Charge","Flooding","Life Drain","Light Star","Hammer Fist","Acid Rain","Black Hole","Out of Time",0,17]
[{"$nulls":8},141,"Eggster",4,"Flame","Sea","Nature",null,"Head Butt","Flaming Arrows","Storm","Leaf Blast","Karate Brick Break","Flamethrower","Whirlpool","Bee Hive",0,23]
[{"$nulls":8},142,"Electric",1,"Electric"," ",null,null,"Punch","Lightning","Stunning Hit","Laser Beam","Hard Charge","Electric Shock","Head Butt","Electro Ball",1,"30m/30m"]
[{"$nulls":8},143,"Elements",4,"Terra","Flame","Sea",null,"Hard Charge","Earthquake","Flaming Arrows","Tsunami","Karate Brick Break","Asteroid","Magma Storm","Whirlpool",0,"1m"]
[{"$nulls":8},144,"Elfic",4,"War","Light",null,null,"Stunning Hit","Giant Claw","Head Butt","Light Sword","Astro Hit","Out of Time","War Fist","Enlightning Wisdom",1,"32/40"]
[{"$nulls":8},145,"Emerald",4,"Metal","Nature",null,null,"Hard Charge","Poison Ivy","Head Butt","Nail Rain","Head Butt","Rottening Spell","Karate Brick Break","Rust",1,"16/24"]
[{"$nulls":8},146,"Energy",4,"Terra","Electric",null,null,"Flying Kick","Earthquake","Laser Beam","Meteor Shower","Deus Sword","Tumble Weed","Tesla Ray","Sand Storm",0,"23"]
[{"$nulls":8},147,"Equinox",3,"Dark","Light",null,null,"Stunning Hit","Light Prism","Leech","Light Star","Hammer Fist","Life Drain","Light Star","Ghost Cloud",0,23]
[{"$nulls":8},148,"Evil Pumpkin",4,"Dark","Nature",null,null,"Head Butt","Leech","Judo Kick","Leaf Blast","Hammer Fist","The Grim Reaper","Karate Brick Break","Bee Hive",0,9]
[{"$nulls":8},149,"Explosive",5,"Flame","Metal","Pure",null,"Hard Charge","Lava Balls","Magneto","Hypnosis","Hammer Fist","Magma Storm","Ninja Stars","Pure Energy",0,23]
[{"$nulls":8},150,"Fairy",3,"Nature","Ice",null,null,"Stunning Hit","Poison Ivy","Snow Storm","Leaf Blast","Karate Brick Break","Rottening Spell","Icy Wind","Bee Hive",0,17]
[{"$nulls":8},151,"Fallen Angel",4,"Light","Dark",null,null,"Flying Kick","Light Sword","Stunning Hit","Ghost Cloud","Light Prism","The Grim Reaper","Light Star","Black Hole",1,"20/28"]
[{"$nulls":8},152,"Father's Day",4,"Sea","Metal","Light",null,"Stunning Hit","Storm","Rust","Light Star","Deus Sword","Whirlpool","Cannon Balls","Light Star",0]
[{"$nulls":8},153,"Faust",5,"War","Light","Ice","Dark","Giant Crack","Light Sword","Frost Nova","Life Drain","Astro Hit","Out of Time","Ice Spikes","Ghost Cloud",0,40]
[{"$nulls":8},154,"Felidae",4,"Legend",{"$nulls":3},"Hammer Fist","Legendary Wind","Paralyzing Spell","Rainbow","Karate Brick Break","Deus Sword","Aurora Borealis","Legend Spell",0,58]
[{"$nulls":8},155,"Fervour",5,"War","Pure","Flame",null,"Giant Crack","Hypnosis","Flaming Arrows","Leech","Astro Hit","Pure Energy","Flamethrower","Black Hole",0,40]
[{"$nulls":8},156,"Firebird",2,"Flame","Nature",null,null,"Flying Kick","Lava Balls","Poison Ivy","Flaming Arrows","Stunning Hit","Nuclear Hit","Head Butt","Rottening Spell",1,"7/13"]
[{"$nulls":8},157,"Firefighter",4,"Flame","Terra","Metal",null,"Stunning Hit","Flaming Arrows","Tumble Weed","Rust","Karate Brick Break","Magma Storm","Sand Storm","Ninja Stars",0,24]
[{"$nulls":8},158,"Flame",1,"Flame"," ",null,null,"Punch","Lava Balls","Flaming Arrows","Nuclear Hit","Hard Charge","Head Butt","Flamethrower","Magma Storm",1,"30s/30s"]
[{"$nulls":8},159,"Flaming Rock",2,"Terra","Flame",null,null,"Flying Kick","Earthquake","Flaming Arrows","Meteor Shower","Stunning Hit","Tumble Weed","Nuclear Hit","Asteroid",1,"30s/30s"]
[{"$nulls":8},160,"Flawless",4,"Beauty","Dream",null,null,"Stunning Hit","Floral Coup","Poisonous Dream","Bright Aura","Karate Brick Break","Deus Sword","Grace Touch","Trance",1,"16/24"]
[{"$nulls":8},161,"Fluorescent",2,"Electric","Ice",null,null,"Flying Kick","Lightning","Ice Spikes","Laser Beam","Stunning Hit","Laser Beam","Electric Shock","Icy Wind",1,"13/19"]
[{"$nulls":8},162,"Force",4,"Light","War","Pure",null,"Punch","Light Prism","Giant Crack","Pure Light","Judo Kick","Out of Time","Astro Hit","Pure Energy",0,"23"]
[{"$nulls":8},163,"Forestry",3,"Nature","Light",null,null,"Judo Kick","Stitching Roots","Light Sword","Poison Ivy","Deus Sword","Rottening Spell","Out of Time","Bee Hive",0,17]
[{"$nulls":8},164,"Forge",5,"Metal","Terra","Ice","Flame","Rust","Meteor Shower","Frost Nova","Flaming Arrows","Cannon Balls","Asteroid","Cryogenic Freeze","Flamethrower",1,"62/72"]
[{"$nulls":8},165,"Fossil",3,"Dark","Ice",null,null,"Hard Charge","Leech","Stunning Hit","Snow Storm","Head Butt","Ghost Cloud","Judo Kick","Icy Wind",1,"16/24"]
[{"$nulls":8},166,"Frankie",4,"Terra","Electric",null,null,"Hard Charge","Meteor Shower","Laser Beam","Tumble Weed","Hammer Fist","Asteroid","Electro Ball","Sand Storm",0,17]
[{"$nulls":8},167,"Frost",5,"Sea","Ice","Dark",null,"Head Butt","Tsunami","Ice Spikes","Life Drain","Deus Sword","Whirlpool","Cryogenic Freeze","Black Hole",0,23]
[{"$nulls":8},168,"Frostbite",4,"Sea","Ice","Dark",null,"Stunning Hit","Tsunami","Frost Nova","Leech","Hammer Fist","Acid Rain","Snow Storm","The Grim Reaper",0,"23"]
[{"$nulls":8},169,"Frozen Wind",4,"Ice","Sea",null,null,"Hard Charge","Frost Nova","Head Butt","Storm","Hammer Fist","Icy Wind","Karate Brick Break","Whirlpool",0,17]
[{"$nulls":8},170,"Fur",4,"Ice","Flame","War",null,"Hard Charge","Snow Storm","Nuclear Hit","Giant Crack","Judo Kick","Icy Wind","Flamethrower","Astro Hit",0,23]
[{"$nulls":8},171,"Gaia",4,"Light","Nature",null,null,"Flying Kick","Light Prism","Stunning Hit","Leaf Blast","Hammer Fist","Enlightning Wisdom","Karate Brick Break","Bee Hive",1,"20/28"]
[{"$nulls":8},172,"Gargoyle",4,"Terra","Ice","Dark",null,"Stunning Hit","Tumble Weed","Ice Spikes","Leech","Karate Brick Break","Asteroid","Icy Wind","The Grim Reaper",1,"11/17"]
[{"$nulls":8},173,"Genie",4,"Flame","Light",null,null,"Punch","Lava Balls","Flaming Arrows","Light Prism","Hammer Fist","Flamethrower","Magma Storm","Light Star",0,23]
[{"$nulls":8},174,"Ghost",4,"Dark","Terra",null,null,"Stunning Hit","Meteor Shower","Head Butt","Ghost Cloud","Judo Kick","Asteroid","Hammer Fist","The Grim Reaper",0,24]
[{"$nulls":8},175,"Giant Wings",4,"Flame","Terra","Ice",null,"Hard Charge","Flaming Arrows","Meteor Shower","Ice Spikes","Deus Sword","Flamethrower","Asteroid","Icy Wind",0,17]
[{"$nulls":8},176,"Gingerbread",4,"Sea","Terra","Light",null,"Judo Kick","Flooding","Meteor Shower","Light Prism","Karate Brick Break","Acid Rain","Sand Storm","Out of Time",0,23]
[{"$nulls":8},177,"Glacial",4,"Ice","Electric","Nature",null,"Punch","Snow Storm","Lightning","Leaf Blast","Deus Sword","Cryogenic Freeze","Electro Ball","Rottening Spell",1,"11/17"]
[{"$nulls":8},178,"Godfather",5,"Dark","War",null,null,"Judo Kick","Life Drain","Leech","Giant Crack","Karate Brick Break","The Grim Reaper","Black Hole","War Fist",0,23]
[{"$nulls":8},179,"Gold",3,"Metal","Electric",null,null,"Hard Charge","Nail Rain","Electric Shock","Magneto","Head Butt","Rust","Tesla Ray","Cannon Balls",1,"9/15"]
[{"$nulls":8},180,"Gold Rush",3,"Terra","Flame",null,null,"Punch","Earthquake","Meteor Shower","Nuclear Hit","Deus Sword","Tumble Weed","Asteroid","Magma Storm",0,17]
[{"$nulls":8},181,"Golden Hand",7,"Electric","War","Light",null,"Hammer Fist","Laser Beam","Giant Crack","Light Prism","Karate Brick Break","Tesla Ray","Giant Mouth","Enlightning Wisdom",0,23]
[{"$nulls":8},182,"Golem",5,"Terra","Pure",null,null,"Stunning Hit","Meteor Shower","Tumble Weed","Hypnosis","Karate Brick Break","Asteroid","Sand Storm","Pure Light",0,23]
[{"$nulls":8},183,"Graduation",4,"Nature","Light","Ice",null,"Stunning Hit","Poison Ivy","Light Prism","Snow Storm","Karate Brick Break","Rottening Spell","Enlightning Wisdom","Cryogenic Freeze",0,23]
[{"$nulls":8},184,"Granite",4,"Terra","Flame",null,null,"Flying Kick","Earthquake","Hard Charge","Flaming Arrows","Hammer Fist","Asteroid","Deus Sword","Magma Storm",0,17]
[{"$nulls":8},185,"Gravity",7,"Pure","Metal","Electric",null,"Hypnosis","Rust","Laser Beam","Light Prism","Pure Light","Cannon Balls","Tesla Ray","Out of Time",0,40]
[{"$nulls":8},186,"Great White",3,"Ice","Terra",null,null,"Hard Charge","Earthquake","Head Butt","Ice Spikes","Judo Kick","Tumble Weed","Hammer Fist","Icy Wind",1,"16/24"]
[{"$nulls":8},187,"Greenfluid",5,"Nature","Sea","Electric",null,"Head Butt","Poison Ivy","Flooding","Electric Shock","Rottening Spell","Tesla Ray","Acid Rain","Bee Hive",1,"58/68"]
[{"$nulls":8},188,"Gummy",4,"Nature","Electric",null,null,"Stunning Hit","Laser Beam","Poison Ivy","Electric Shock","Judo Kick","Electro Ball","Rottening Spell","Tesla Ray",1,"7/13"]
[{"$nulls":8},189,"Gurgle",3,"Magic","Happy",null,null,"Judo Kick","Brilliant Firework","Magic Blow","Festive Lights","Karate Brick Break","Deus Sword","Appeal","Vigor Feel",1,"16/24"]
[{"$nulls":8},190,"Hades",4,"Sea","Dark",null,null,"Hard Charge","Flooding","Head Butt","Ghost Cloud","Hammer Fist","Acid Rain","Karate Brick Break","The Grim Reaper",0,17]
[{"$nulls":8},191,"Halloween",4,"Dark","Nature",null,null,"Stunning Hit","Leech","Poison Ivy","Ghost Cloud","Karate Brick Break","The Grim Reaper","Rottening Spell","Black Hole",0,17]
[{"$nulls":8},192,"Hammer",4,"Metal","Sea",null,null,"Magneto","Tsunami","Stunning Hit","Flooding","Hard Charge","Storm","Judo Kick","Storm",1,"11/17"]
[{"$nulls":8},193,"Handy",4,"Terra","Flame","Metal",null,"Head Butt","Earthquake","Lava Balls","Nail Rain","Deus Sword","Tumble Weed","Flamethrower","Rust",0,23]
[{"$nulls":8},194,"Hansel & Gretel",4,"Nature","Flame","Terra",null,"Punch","Stitching Roots","Flaming Arrows","Tumble Weed","Karate Brick Break","Rottening Spell","Flamethrower","Sand Storm",0,16]
[{"$nulls":8},195,"Hawaiian",3,"Nature","Electric",null,null,"Punch","Stitching Roots","Laser Beam","Electric Shock","Hammer Fist","Rottening Spell","Electro Ball","Tesla Ray",0,17]
[{"$nulls":8},196,"Heart",4,"Flame","Light",null,null,"Punch","Flaming Arrows","Judo Kick","Light Prism","Karate Brick Break","Light Star","Flamethrower","Enlightning Wisdom",0,17]
[{"$nulls":8},197,"Hearts Queen",4,"Flame","Metal",null,null,"Punch","Stunning Hit","Lightning","Nail Rain","Hammer Fist","Karate Brick Break","Electro Ball","Cannon Balls",0,17]
[{"$nulls":8},198,"Heat",4,"Dark","Metal","Flame",null,"Head Butt","Leech","Nail Rain","Nuclear Hit","Hammer Fist","Ghost Cloud","Magneto","Magma Storm",0,23]
[{"$nulls":8},199,"Hedgehog",2,"Terra","Dark",null,null,"Flying Kick","Earthquake","Leech","Meteor Shower","Stunning Hit","Asteroid","Ghost Cloud","Tumble Weed",1,"9/15"]
[{"$nulls":8},200,"Hellgate",4,"Dark","Flame","Pure","War","Ghost Cloud","Nuclear Hit","Hypnosis","Giant Claw","Black Hole","Magma Storm","Pure Light","War Fist",0,23]
[{"$nulls":8},201,"Heroic",9,"Terra","Light","metal","War","Asteroid","Light Sword","Rust","Giant Crack","Sand Storm","Light Prism","Ninja Stars","War Fist",0,40]
[{"$nulls":8},202,"Homerun",4,"Ice","Electric","Light",null,"Punch","Ice Spikes","Electric Shock","Enlightning Wisdom","Head Butt","Snow Storm","Tesla Ray","Out of Time",0,"23"]
[{"$nulls":8},203,"Hope",5,"Legend",{"$nulls":3},"Punch","Legendary Wind","Flying Kick","Rainbow","Stunning Hit","Aurora Borealis","Karate Brick Break","Legend Spell",0,40]
[{"$nulls":8},204,"Hot Metal",3,"Electric","Flame",null,null,"Hard Charge","Laser Beam","Stunning Hit","Nuclear Hit","Head Butt","Electric Shock","Judo Kick","Flamethrower",1,"9/15"]
[{"$nulls":8},205,"Howl",4,"Dark","Nature","Electric",null,"Hard Charge","Leech","Poison Ivy","Electric Shock","The Grim Reaper","Deus Sword","Rottening Spell","Tesla Ray",1,"39/47"]
[{"$nulls":8},206,"Hydra",5,"Electric","Sea",null,null,"Hard Charge","Laser Beam","Stunning Hit","Storm","Head Butt","Electric Shock","Judo Kick","Whirlpool",1,"40/48"]
[{"$nulls":8},207,"Hypno",4,"Dark","Nature",null,null,"Stunning Hit","Ghost Cloud","Flying Kick","Poison Ivy","Leech","Rottening Spell","Black Hole","Bee Hive",0,17]
[{"$nulls":8},208,"Ice",1,"Ice"," ",null,null,"Punch","Frost Nova","Stunning Hit","Ice Spikes","Hard Charge","Snow Storm","Head Butt","Icy Wind",1,15]
[{"$nulls":8},209,"Ice Cream",2,"Sea","Ice",null,null,"Flying Kick","Flooding","Hard Charge","Ice Spikes","Stunning Hit","Storm","Head Butt","Snow Storm",1,"13/19"]
[{"$nulls":8},210,"Ice&Fire",4,"Flame","Ice",null,null,"Stunning Hit","Ice Spikes","Nuclear Hit","Snow Storm","Judo Kick","Icy Wind","Magma Storm","Cryogenic Freeze",1,"28/36"]
[{"$nulls":8},211,"Iceberg",3,"Ice","Sea",null,null,"Judo Kick","Frost Nova","Storm","Ice Spikes","Deus Sword","Icy Wind","Whirlpool","Cryogenic Freeze",0,17]
[{"$nulls":8},212,"Icecube",2,"Sea","Ice",null,null,"Punch","Frost Nova","Stunning Hit","Ice Spikes","Stunning Hit","Storm","Icy Wind","Acid Rain",1,"9/15"]
[{"$nulls":8},213,"Ifrit",3,"Flame","Terra","Dark",null,"Flying Kick","Flaming Arrows","Leech","Asteroid","Head Butt","Magma Storm","The Grim Reaper","Sand Storm",0,23]
[{"$nulls":8},214,"Illusion",7,"Magic","Dream",null,null,"Head Butt","Confusing Wake","Mana Lightnings","Poisonous Dream","Karate Brick Break","Deus Sword","Trance","Vigor Feel",1,"16/24"]
[{"$nulls":8},215,"Immortal",5,"Legend",{"$nulls":3},"Flying Kick","Paralyzing Spell","Head Butt","Rainbow","Karate Brick Break","Aurora Borealis","Deus Sword","Legend Spell",0,58]
[{"$nulls":8},216,"Imp",9,"Legend",{"$nulls":3},"Punch","Legendary Wind","Hard Charge","Rainbow","Judo Kick","Aurora Borealis","Deus Sword","Legend Spell",0,58]
[{"$nulls":8},217,"Impassible",9,"Legend",{"$nulls":3},"Stunning Hit","Legendary Wind","Head Butt","Paralyzing Spell","Hammer Fist","Rainbow","Deus Sword","Aurora Borealis",0,"58"]
[{"$nulls":8},218,"Independence Day",4,"Flame","Electric","Metal",null,"Punch","Lava Balls","Lightning","Magneto","Hammer Fist","Flamethrower","Electro Ball","Cannon Balls",0,"23"]
[{"$nulls":8},219,"Inesta",3,"Terra","Ice","Pure",null,"Punch","Tumble Weed","Snow Storm","Hypnosis","Hammer Fist","Sand Storm","Cryogenic Freeze","Pure Light",0,"22"]
[{"$nulls":8},220,"Infamous",5,"War","Ice","Dark",null,"Flying Kick","Frost Nova","Giant Mouth","Ghost Cloud","Icy Wind","Astro Hit","Deus Sword","The Grim Reaper",0,"23"]
[{"$nulls":8},221,"Iron",6,"War","Metal","Electric",null,"Hard Charge","Giant Crack","Nail Rain","Laser Beam","Judo Kick","Giant Claw","Magneto","Electro Ball",0,"23"]
[{"$nulls":8},222,"Ivory",4,"Terra","Pure",null,null,"Hard Charge","Meteor Shower","Head Butt","Tumble Weed","Karate Brick Break","Sand Storm","Deus Sword","Pure Light",1,"11/17"]
[{"$nulls":8},223,"Jade",2,"Nature","Metal",null,null,"Flying Kick","Stitching Roots","Magneto","Poison Ivy","Stunning Hit","Leaf Blast","Cannon Balls","Bee Hive",1,"13/19"]
[{"$nulls":8},224,"Jamaican",4,"Electric","Nature","Flame",null,"Stunning Hit","Laser Beam","Poison Ivy","Nuclear Hit","Hammer Fist","Electro Ball","Bee Hive","Magma Storm",0,"17"]
[{"$nulls":8},225,"Jason",8,"Legend","Dark","Sea",null,"Punch","Legendary Wind","Life Drain","Tsunami","Head Butt","Paralyzing Spell","Ghost Cloud","Storm",0,"15"]
[{"$nulls":8},226,"Jelly",4,"Sea","Terra",null,null,"Hard Charge","Flooding","Head Butt","Tumble Weed","Judo Kick","Storm","Karate Brick Break","Asteroid",1,"9/15"]
[{"$nulls":8},227,"Jellyfish",3,"Sea","Nature",null,null,"Hard Charge","Flooding","Head Butt","Leaf Blast","Judo Kick","Acid Rain","Hammer Fist","Rottening Spell",0,"15"]
[{"$nulls":8},228,"Joker",4,"Flame","Dark",null,null,"Hard Charge","Leech","Flaming Arrows","Ghost Cloud","Judo Kick","The Grim Reaper","Magma Storm","Black Hole",1,"11/17"]
[{"$nulls":8},229,"Joseon",4,"Flame","Sea","Metal",null,"Punch","Lava Balls","Tsunami","Nail Rain","Karate Brick Break","Flamethrower","Acid Rain","Ninja Stars",0,24]
[{"$nulls":8},230,"Juggernaut",4,"War","Flame",null,null,"Hard Charge","Giant Mouth","Head Butt","Nuclear Hit","Hammer Fist","Astro Hit","Karate Brick Break","Magma Storm",1,"32/40"]
[{"$nulls":8},231,"Juggler",4,"Nature","Sea",null,null,"Stunning Hit","Poison Ivy","Punch","Flooding","Rottening Spell","Acid Rain","Bee Hive","Whirlpool",0,"17"]
[{"$nulls":8},232,"Justice",4,"Light","Terra",null,null,"Hard Charge","Light Sword","Stunning Hit","Earthquake","Karate Brick Break","Enlightning Wisdom","Deus Sword","Asteroid",1,"20/28"]
[{"$nulls":8},233,"Kaiju",4,"Terra","Sea","War",null,"Head Butt","Tsunami","Tumble Weed","Giant Claw","Hammer Fist","Acid Rain","War Fist","Whirlpool",0,"23"]
[{"$nulls":8},234,"King",4,"Metal","Flame",null,null,"Hard Charge","Magneto","Stunning Hit","Nuclear Hit","Judo Kick","Rust","Hammer Fist","Flamethrower",0,"24"]
[{"$nulls":8},235,"King Solomon",4,"Light","Dark",null,null,"Flying Kick","Light Sword","Judo Kick","Life Drain","Light Sword","The Grim Reaper","Light Prism","Black Hole",0,"17"]
[{"$nulls":8},236,"Kooky",4,"Electric","Dark","War",null,"Head Butt","Electro Ball","Life Drain","Giant Crack","Judo Kick","Tesla Ray","The Grim Reaper","War Fist",0,40]
[{"$nulls":8},237,"Korean Soccer",4,"Ice","Flame",null,null,"Stunning Hit","Ice Spikes","Nuclear Hit","Snow Storm","Judo Kick","Icy Wind","Magma Storm","Cryogenic Freeze",1,"9/15"]
[{"$nulls":8},238,"Krait",5,"Sea","Pure",null,null,"Hard Charge","Flooding","Storm","Pure Energy","Karate Brick Break","Acid Rain","Whirlpool","Pure Light",0,"23"]
[{"$nulls":8},239,"Kratus",4,"War","Pure",null,null,"Head Butt","Giant Crack","Hard Charge","Giant Claw","War Fist","Hypnosis","Astro Hit","Pure Energy",1,"32/40"]
[{"$nulls":8},240,"Kryptonite",4,"Nature","Ice","Dark",null,"Hard Charge","Poison Ivy","Frost Nova","Leech","Hammer Fist","Bee Hive","Cryogenic Freeze","Black Hole",0,"17"]
[{"$nulls":8},241,"La Muerta",4,"Flame","Metal","Dark",null,"Flying Kick","Flaming Arrows","Rust","Life Drain","Hard Charge","Nuclear Hit","Cannon Balls","Ghost Cloud",0,"17"]
[{"$nulls":8},242,"Lantern Fish",2,"Sea","Electric",null,null,"Flying Kick","Tsunami","Laser Beam","Flooding","Hard Charge","Storm","Electric Shock","Acid Rain",1,"7/13"]
[{"$nulls":8},243,"Laser",2,"Flame","Electric",null,null,"Flying Kick","Lava Balls","Laser Beam","Flaming Arrows","Stunning Hit","Flamethrower","Electro Ball","Nuclear Hit",1,"9/15"]
[{"$nulls":8},244,"Lava",4,"Flame","Terra","Dark",null,"Stunning Hit","Lava Balls","Meteor Shower","Leech","Judo Kick","Flamethrower","Asteroid","Black Hole",1,"16/24"]
[{"$nulls":8},245,"Legacy",5,"Legend",{"$nulls":3},"Head Butt","Legendary Wind","Paralyzing Spell","Rainbow","Judo Kick","Karate Brick Break","Aurora Borealis","Legend Spell",1,"50/58"]
[{"$nulls":8},246,"Leviathan",4,"War","Sea",null,null,"Punch","Giant Mouth","Stunning Hit","Tsunami","Hammer Fist","Astro Hit","Karate Brick Break","Whirlpool",1,"32/40"]
[{"$nulls":8},247,"Lightbeam",4,"Electric","Light",null,null,"Punch","Lightning","Flying Kick","Light Prism","Electro Ball","Enlightning Wisdom","Tesla Ray","Out of Time",0,23]
[{"$nulls":8},248,"Lightning",4,"Electric","Sea",null,null,"Lightning","Hard Charge","Electric Shock","Storm","Deus Sword","Tesla Ray","Whirlpool","Acid Rain",0,17]
[{"$nulls":8},249,"Little Red Riding Hood",4,"Nature","Flame","Electric",null,"Punch","Stitching Roots","Flaming Arrows","Meteor Shower","Hammer Fist","Rottening Spell","Flamethrower","Electro Ball",0,"23"]
[{"$nulls":8},250,"Loki",4,"War","Flame","Dark",null,"Flying Kick","Giant Crack","Nuclear Hit","Leech","Deus Sword","War Fist","Magma Storm","The Grim Reaper",0,"17"]
[{"$nulls":8},251,"Longhorn",5,"Terra","Nature",null,null,"Hard Charge","Earthquake","Poison Ivy","Hypnosis","Hammer Fist","Asteroid","Rottening Spell","Pure Light",0,"23"]
[{"$nulls":8},252,"Love",4,"Flame","Electric","Nature",null,"Stunning Hit","Nuclear Hit","Head Butt","Electric Shock","Judo Kick","Rottening Spell","Deus Sword","Electro Ball",0,24]
[{"$nulls":8},253,"Luminescent",4,"Light","Sea",null,null,"Flying Kick","Light Prism","Hard Charge","Flooding","Karate Brick Break","Enlightning Wisdom","Deus Sword","Whirlpool",1,"20/28"]
[{"$nulls":8},254,"Mace",4,"Terra","Metal","Dark",null,"Hard Charge","Meteor Shower","Nail Rain","Life Drain","Hammer Fist","Sand Storm","Ninja Stars","Black Hole",0,"23"]
[{"$nulls":8},255,"Magnet",4,"Terra","Metal","Electric",null,"Flying Kick","Tumble Weed","Magneto","Electric Shock","Sand Storm","Cannon Balls","Hammer Fist","Electro Ball",1,"39/47"]
[{"$nulls":8},256,"Mana",4,"Dark","Electric","Flame",null,"Hammer Fist","Life Drain","Electric Shock","Nuclear Hit","Karate Brick Break","The Grim Reaper","Electro Ball","Flamethrower",0,"23"]
[{"$nulls":8},257,"Manglar",4,"Terra","Sea","Nature",null,"Judo Kick","Meteor Shower","Flooding","Poison Ivy","Karate Brick Break","Asteroid","Acid Rain","Bee Hive",0,"23"]
[{"$nulls":8},258,"Mantis",2,"Electric","Nature","Sea",null,"Punch","Laser Beam","Stitching Roots","Storm","Head Butt","Electric Shock","Bee Hive","Whirlpool",0,"15"]
[{"$nulls":8},259,"Mardi Gras",4,"Sea","Nature","Light",null,"Stunning Hit","Flooding","Leaf Blast","Light Sword","Hammer Fist","Acid Rain","Bee Hive","Out of Time",0,"23"]
[{"$nulls":8},260,"Mars",4,"Sea","Nature",null,null,"Hard Charge","Flooding","Head Butt","Leaf Blast","Judo Kick","Acid Rain","Hammer Fist","Rottening Spell",0,15]
[{"$nulls":8},261,"Martial Arts",4,"Flame","Electric",null,null,"Punch","Nuclear Hit","Judo Kick","Lightning","Hammer Fist","Flamethrower","Karate Brick Break","Magma Storm",0,"17"]
[{"$nulls":8},262,"Master",5,"Flame","Sea","War",null,"Hard Charge","Nuclear Hit","Tsunami","Giant Mouth","Karate Brick Break","Magma Storm","Whirlpool","Astro Hit",1,"58/68"]
[{"$nulls":8},263,"Medieval",2,"Flame","Metal",null,null,"Flying Kick","Lava Balls","Magneto","Flaming Arrows","Head Butt","Nuclear Hit","Cannon Balls","Flamethrower",1,"9/15"]
[{"$nulls":8},264,"Mercury",1,"Sea","Metal",null,null,"Magneto","Tsunami","Stunning Hit","Flooding","Hard Charge","Storm","Judo Kick","Storm",1,"9/15"]
[{"$nulls":8},265,"Mermaid",4,"Beauty","Magic",null,null,"Head Butt","Floral Coup","Mana Lightnings","Bright Aura","Karate Brick Break","Deus Sword","Grace Touch","Vigor Feel",1,"16/24"]
[{"$nulls":8},266,"Metal",1,"Metal",{"$nulls":3},"Punch","Nail Rain","Stunning Hit","Magneto","Hard Charge","Rust","Judo Kick","Cannon Balls",1,"7/13"]
[{"$nulls":8},267,"Meteor",4,"Flame","Terra","Dark",null,"Flying Kick","Flaming Arrows","Meteor Shower","Ghost Cloud","Hammer Fist","Magma Storm","Asteroid","Black Hole",1,"11/17"]
[{"$nulls":8},268,"Midas",4,"Terra","Metal","Dark",null,"Punch","Nail Rain","Head Butt","Earthquake","Cannon Balls","Sand Storm","The Grim Reaper","Asteroid",0,"17"]
[{"$nulls":8},269,"Middle Earth",4,"Terra","Light",null,null,"Punch","Earthquake","Head Butt","Light Sword","Enlightning Wisdom","Deus Sword","Out of Time","Sand Storm",0,"17"]
[{"$nulls":8},270,"Millenium",5,"Sea","War","Terra","Metal","Flooding","Giant Claw","Meteor Shower","Nail Rain","Acid Rain","Astro Hit","Asteroid","Ninja Stars",1,"88.75/98.75"]
[{"$nulls":8},271,"Mirage",5,"Flame","Ice","Nature","Electric","Lava Balls","Snow Storm","Leaf Blast","Lightning","Magma Storm","Icy Wind","Bee Hive","Electro Ball",1,"81.7/91.7"]
[{"$nulls":8},272,"Mirror",5,"Legend",{"$nulls":3},"Head Butt","Legendary Wind","Rainbow","Judo Kick","Hammer Fist","Paralyzing Spell","Aurora Borealis","Karate Brick Break",1,"50/58"]
[{"$nulls":8},273,"Mistletoe",5,"Nature","Sea","Ice",null,"Hard Charge","Stitching Roots","Poison Ivy","Ice Spikes","Deus Sword","Bee Hive","Acid Rain","Cryogenic Freeze",0,"23"]
[{"$nulls":8},274,"Mojito",3,"Nature","Ice",null,null,"Hard Charge","Poison Ivy","Stunning Hit","Snow Storm","Judo Kick","Leaf Blast","Hammer Fist","Icy Wind",1,"9/15"]
[{"$nulls":8},275,"Molluck",8,"Legend","Soul",null,null,"Stunning Hit","Paralyzing Spell","Celestial Hand","Rainbow","Hammer Fist","Aurora Borealis","Ghostly Blades","Legend Spell",0,"58"]
[{"$nulls":8},276,"Monstruous",4,"Sea","Terra",null,null,"Hard Charge","Storm","Head Butt","Tumble Weed","Hammer Fist","Acid Rain","Deus Sword","Sand Storm",0,17]
[{"$nulls":8},277,"Moon",4,"Terra","Ice",null,null,"Punch","Meteor Shower","Stunning Hit","Snow Storm","Hammer Fist","Asteroid","Deus Sword","Cryogenic Freeze",0,"17"]
[{"$nulls":8},278,"Moose",3,"Electric","Ice",null,null,"Hard Charge","Laser Beam","Stunning Hit","Ice Spikes","Head Butt","Electric Shock","Hammer Fist","Icy Wind",1,"9/15"]
[{"$nulls":8},279,"Mother",4,"Terra","Flame","Light",null,"Punch","Earthquake","Flaming Arrows","Light Sword","Karate Brick Break","Meteor Shower","Magma Storm","Enlightning Wisdom",0,"23"]
[{"$nulls":8},280,"Motherly",4,"Light","Pure",null,null,"Stunning Hit","Light Prism","Pure Energy","Light Star","Enlightning Wisdom","Hypnosis","Out of Time","Pure Light",0,"23"]
[{"$nulls":8},281,"Mother's Day",4,"Sea","Ice","Light",null,"Judo Kick","Storm","Snow Storm","Light Star","Karate Brick Break","Whirlpool","Icy Wind","Enlightning Wisdom",0]
[{"$nulls":8},282,"Motorbike",4,"Metal","Flame","War",null,"Head Butt","Nail Rain","Flaming Arrows","Giant Claw","Hammer Fist","Ninja Stars","Magma Storm","War Fist",0,"23"]
[{"$nulls":8},283,"Mould",4,"Nature","Terra","Flame",null,"Hard Charge","Stitching Roots","Earthquake","Nuclear Hit","Hammer Fist","Rottening Spell","Sand Storm","Magma Storm",0,"23"]
[{"$nulls":8},284,"Mozart",4,"Electric","Ice","Metal",null,"Punch","Lightning","Snow Storm","Rust","Hammer Fist","Electro Ball","Icy Wind","Ninja Stars",0,"23"]
[{"$nulls":8},285,"Mud",2,"Terra","Sea",null,null,"Flying Kick","Tsunami","Earthquake","Flooding","Stunning Hit","Acid Rain","Tumble Weed","Storm",1,"5/7"]
[{"$nulls":8},286,"Mummy",4,"Electric","Dark"," ",null,"Hard Charge","Laser Beam","Life Drain","Leech","Hammer Fist","Electro Ball","Ghost Cloud","The Grim Reaper",0,17]
[{"$nulls":8},287,"Music",4,"Flame","Electric",null,null,"Stunning Hit","Flaming Arrows","Head Butt","Electric Shock","Judo Kick","Nuclear Hit","Karate Brick Break","Electro Ball",1,"16/24"]
[{"$nulls":8},288,"Mystic Blizzard",5,"Ice","Sea","War",null,"Hard Charge","Frost Nova","Tsunami","Giant Crack","Deus Sword","Icy Wind","Whirlpool","Astro Hit",0,"23"]
[{"$nulls":8},289,"Mystic Plant",5,"Nature","Light","Pure",null,"Flying Kick","Poison Ivy","Light Prism","Pure Energy","Deus Sword","Rottening Spell","Enlightning Wisdom","Pure Light",0,"23"]
[{"$nulls":8},290,"Mystic Tribe",5,"War","Light",null,null,"Stunning Hit","Giant Crack","Giant Mouth","Light Star","Karate Brick Break","Astro Hit","War Fist","Out of Time",0,"23"]
[{"$nulls":8},291,"Mystic War",5,"War","Nature","Terra",null,"Stunning Hit","Giant Crack","Poison Ivy","Meteor Shower","Karate Brick Break","Astro Hit","Bee Hive","Sand Storm",0,"23"]
[{"$nulls":8},292,"Nature",1,"Nature"," ",null,null,"Punch","Stitching Roots","Poison Ivy","Leaf Blast","Hard Charge","Rottening Spell","Stunning Hit","Bee Hive",1,"20m/20m"]
[{"$nulls":8},293,"Naughty",3,"Chaos","Happy",null,null,"Head Butt","Brilliant Firework","Infernal Crack","Festive Lights","Karate Brick Break","Deus Sword","Appeal","Disorder",1,"16/24"]
[{"$nulls":8},294,"Nazca",4,"Dark","Ice","Sea",null,"Punch","Life Drain","Snow Storm","Tsunami","Judo Kick","Leech","Cryogenic Freeze","Whirlpool",0,40]
[{"$nulls":8},295,"Necro",5,"Dark","Terra","Metal",null,"Flying Kick","Life Drain","Meteor Shower","Rust","Hammer Fist","The Grim Reaper","Sand Storm","Ninja Stars",0,"23"]
[{"$nulls":8},296,"Necromancer",4,"Ice","Dark","War",null,"Punch","Snow Storm","Ghost Cloud","Giant Crack","Deus Sword","Cryogenic Freeze","Black Hole","War Fist",0,"23"]
[{"$nulls":8},297,"Nenufar",2,"Sea","Nature",null,null,"Flying Kick","Tsunami","Poison Ivy","Flooding","Hard Charge","Storm","Rottening Spell","Head Butt",1,"5/7"]
[{"$nulls":8},298,"Neon",2,"Electric","Dark",null,null,"Flying Kick","Lightning","Leech","Laser Beam","Stunning Hit","Electric Shock","Ghost Cloud","Electro Ball",1,"9/15"]
[{"$nulls":8},299,"Never Grow",4,"Nature","Electric","Flame",null,"Stunning Hit","Poison Ivy","Electric Shock","Nuclear Hit","Judo Kick","Leaf Blast","Electro Ball","Magma Storm",0,"23"]
[{"$nulls":8},300,"Ney",3,"Terra","Electric","Light",null,"Judo Kick","Meteor Shower","Electric Shock","Light Prism","Karate Brick Break","Electro Ball","Tesla Ray","Light Sword",0,"22"]
[{"$nulls":8},301,"Nightwind",4,"War","Ice",null,null,"Flying Kick","Frost Nova","Giant Mouth","Snow Storm","Icy Wind","Astro Hit","Deus Sword","Cryogenic Freeze",1,"32/40"]
[{"$nulls":8},302,"Ninja",4,"Metal","Nature",null,null,"Hard Charge","Poison Ivy","Head Butt","Nail Rain","Head Butt","Rottening Spell","Karate Brick Break","Rust",1,"9/15"]
[{"$nulls":8},303,"Nirobi",4,"Legend",{"$nulls":3},"Flying Kick","Paralyzing Spell","Stunning Hit","Rainbow","Hammer Fist","Aurora Borealis","Karate Brick Break","Legend Spell",1,"50/58"]
[{"$nulls":8},304,"Nisse",4,"Nature","Electric",null,null,"Karate Brick Break","Stitching Roots","Lightning","Poison Ivy","Deus Sword","Rottening Spell","Tesla Ray","Bee Hive",0,23]
[{"$nulls":8},305,"Nocturnal",4,"Dark","Metal","War",null,"Stunning Hit","Leech","Magneto","Giant Crack","Karate Brick Break","Black Hole","Cannon Balls","War Fist",0,"23"]
[{"$nulls":8},306,"O Rei",3,"Terra","Pure","Light",null,"Head Butt","Tumble Weed","Pure Energy","Light Star","Deus Sword","Sand Storm","Pure Light","Light Star",0,"22"]
[{"$nulls":8},307,"Obscure",9,"Legend","Dark",null,null,"Punch","Legendary Wind","Life Drain","Rainbow","Hammer Fist","Aurora Borealis","Leech","Legend Spell",0,"23"]
[{"$nulls":8},308,"Obsidian",4,"Dark","Terra",null,null,"Flying Kick","Life Drain","Stunning Hit","Earthquake","Hammer Fist","The Grim Reaper","Karate Brick Break","Sand Storm",0,"17"]
[{"$nulls":8},309,"Ocean",4,"Ice","Sea","Nature",null,"Hard Charge","Frost Nova","Flooding","Leaf Blast","Hammer Fist","Cryogenic Freeze","Whirlpool","Bee Hive",0,"23"]
[{"$nulls":8},310,"Octopus",5,"Dark","Sea",null,null,"Stunning Hit","Flooding","Judo Kick","Ghost Cloud","Hammer Fist","The Grim Reaper","Karate Brick Break","Acid Rain",0,"15"]
[{"$nulls":8},311,"Odin",4,"War","Flame","Light",null,"Stunning Hit","Giant Claw","Nuclear Hit","Light Star","Deus Sword","War Fist","Magma Storm","Enlightning Wisdom",0,"17"]
[{"$nulls":8},312,"Old General",4,"Sea","Terra","War",null,"Punch","Tsunami","Earthquake","Giant Crack","Head Butt","Flooding","Tumble Weed","Giant Claw",0,"23"]
[{"$nulls":8},313,"Oni",4,"Flame","Dark",null,null,"Stunning Hit","Lava Balls","Head Butt","Leech","Flamethrower","Hammer Fist","Magma Storm","The Grim Reaper",0,"17"]
[{"$nulls":8},314,"Orange",3,"Terra","War","Flame",null,"Hard Charge","Earthquake","Giant Mouth","Lava Balls","Hammer Fist","Asteroid","Astro Hit","Magma Storm",0,"22"]
[{"$nulls":8},315,"Orc",3,"Dark ","War",null,null,"Head Butt","Life Drain","Giant Mouth","Leech","Hammer Fist","Ghost Cloud","Astro Hit","Black Hole",0,"17"]
[{"$nulls":8},316,"Origami",4,"Nature","Terra",null,null,"Punch","Poison Ivy","Flying Kick","Tumble Weed","Hammer Fist","Bee Hive","Deus Sword","Sand Storm",0,"17"]
[{"$nulls":8},317,"Paladin",2,"Electric","Terra",null,null,"Flying Kick","Meteor Shower","Stunning Hit","Electric Shock","Head Butt","Tumble Weed","Judo Kick","Electro Ball",0,"15"]
[{"$nulls":8},318,"Panzer",4,"War","Metal",null,null,"Nail Rain","Giant Claw","Head Butt","Magneto","Karate Brick Break","War Fist","Deus Sword","Cannon Balls",1,"32/40"]
[{"$nulls":8},319,"Paradise",3,"Nature","Flame",null,null,"Hard Charge","Poison Ivy","Head Butt","Nuclear Hit","Judo Kick","Leaf Blast","Hammer Fist","Flamethrower",1,"16/24"]
[{"$nulls":8},320,"Patriot",4,"Light","Terra","Flame",null,"Punch","Light Prism","Meteor Shower","Flaming Arrows","Hammer Fist","Out of Time","Sand Storm","Magma Storm",0,"23"]
[{"$nulls":8},321,"Peace",4,"Nature","Light",null,null,"Punch","Stitching Roots","Flying Kick","Light Prism","Hammer Fist","Bee Hive","Deus Sword","Enlightning Wisdom",0,"17"]
[{"$nulls":8},322,"Pearl",2,"Ice","Metal",null,null,"Flying Kick","Frost Nova","Magneto","Ice Spikes","Stunning Hit","Snow Storm","Rust","Icy Wind",1,"13/19"]
[{"$nulls":8},323,"Pelusa",3,"Terra","Dark","War",null,"Punch","Earthquake","Leech","Giant Crack","Karate Brick Break","Asteroid","The Grim Reaper","Giant Crack",0,"22"]
[{"$nulls":8},324,"Penguin",2,"Ice","Dark",null,null,"Flying Kick","Frost Nova","Leech","Ice Spikes","Stunning Hit","Snow Storm","Ghost Cloud","Icy Wind",1,"12/18"]
[{"$nulls":8},325,"Petal",4,"Nature","Light","Terra",null,"Hard Charge","Stitching Roots","Light Sword","Meteor Shower","Stunning Hit","Rottening Spell","Light Prism","Sand Storm",0,23]
[{"$nulls":8},326,"Petroleum",4,"Sea","Dark",null,null,"Stunning Hit","Flooding","Ghost Cloud","Storm","Judo Kick","Acid Rain","The Grim Reaper","Whirlpool",1,"13/19"]
[{"$nulls":8},327,"Pharaoh",4,"Electric","Terra",null,null,"Lightning","Earthquake","Electric Shock","Meteor Shower","Electro Ball","Asteroid","Tesla Ray","Sand Storm",0,"15"]
[{"$nulls":8},328,"Photon",4,"Light","Electric",null,null,"Stunning Hit","Light Prism","Lightning","Electric Shock","Enlightning Wisdom","Electro Ball","Out of Time","Tesla Ray",1,"20/28"]
[{"$nulls":8},329,"Pig",5,"Legend","Dark",null,null,"Hard Charge","Legendary Wind","Ghost Cloud","Rainbow","Karate Brick Break","Aurora Borealis","Black Hole","Legend Spell",0,"40"]
[{"$nulls":8},330,"Pirate",4,"Dark","Sea",null,null,"Stunning Hit","Leech","Storm","Ghost Cloud","Judo Kick","The Grim Reaper","Acid Rain","Black Hole",1,"12/18"]
[{"$nulls":8},331,"Plankton",3,"Sea","Terra",null,null,"Stunning Hit","Flooding","Head Butt","Earthquake","Judo Kick","Storm","Karate Brick Break","Sand Storm",1,"16/24"]
[{"$nulls":8},332,"Platinum",3,"Metal","Ice",null,null,"Hard Charge","Magneto","Judo Kick","Snow Storm","Head Butt","Cannon Balls","Hammer Fist","Icy Wind",1,"9/15"]
[{"$nulls":8},333,"Poker",4,"Terra","Ice","Dark",null,"Judo Kick","Meteor Shower","Snow Storm","Leech","Sand Storm","The Grim Reaper","Icy Wind","Black Hole",0,"17"]
[{"$nulls":8},334,"Poo",2,"Terra","Sea","Dark",null,"Flying Kick","Earthquake","Tsunami","Leech","Stunning Hit","Tumble Weed","Storm","Ghost Cloud",1,"12/18"]
[{"$nulls":8},335,"Poseidon",4,"Sea",{"$nulls":3},"Flying Kick","Tsunami","Head Butt","Storm","Hammer Fist","Acid Rain","Deus Sword","Whirlpool",0,"17"]
[{"$nulls":8},336,"Predator",4,"Dark","Flame","Terra",null,"Punch","Life Drain","Flaming Arrows","Tumble Weed","Karate Brick Break","The Grim Reaper","Flamethrower","Sand Storm",0,"17"]
[{"$nulls":8},337,"Prisma",4,"Ice","Electric",null,null,"Hard Charge","Laser Beam","Stunning Hit","Ice Spikes","Head Butt","Electric Shock","Hammer Fist","Icy Wind",1,"28/36"]
[{"$nulls":8},338,"Promethium",5,"Light","Dark","Nature","Electric","Light Star","Leech","Poison Ivy","Laser Beam","Enlightning Wisdom","Black Hole","Bee Hive","Electro Ball",1,"62/72"]
[{"$nulls":8},339,"Prophet",7,"Chaos","Dream",null,null,"Stunning Hit","Confusing Wake","Destiny Chains","Poisonous Dream","Karate Brick Break","Deus Sword","Trance","Disorder",1,"16/24"]
[{"$nulls":8},340,"Pterodactyl",4,"Terra","Nature","Electric",null,"Flying Kick","Meteor Shower","Leaf Blast","Electric Shock","Electro Ball","Bee Hive","Tesla Ray","Asteroid",0,"22"]
[{"$nulls":8},341,"Pulga",3,"Terra","Pure","Light",null,"Stunning Hit","Tumble Weed","Pure Energy","Light Star","Deus Sword","Sand Storm","Pure Energy","Light Prism",0,"22"]
[{"$nulls":8},342,"Pure",5,"Pure",{"$nulls":3},"Lava Balls","Hypnosis","Karate Brick Break","Pure Energy","Karate Brick Break","Pure Light","Deus Sword","Pure Light",1,"9/15"]
[{"$nulls":8},343,"Pure Dark",5,"Pure","Dark",null,null,"Head Butt","Leech","Hammer Fist","The Grim Reaper","Karate Brick Break","Black Hole","Deus Sword","Pure Light",1,"44/52"]
[{"$nulls":8},344,"Pure Electric",5,"Pure","Electric",null,null,"Stunning Hit","Electric Shock","Karate Brick Break","Electro Ball","Deus Sword","Electro Ball","Tesla Ray","Pure Energy",1,"44/52"]
[{"$nulls":8},345,"Pure Flame",5,"Pure","Flame",null,null,"Stunning Hit","Nuclear Hit","Karate Brick Break","Flamethrower","Deus Sword","Flamethrower","Magma Storm","Hypnosis",1,"44/52"]
[{"$nulls":8},346,"Pure Ice",5,"Pure","Ice",null,null,"Head Butt","Icy Wind","Judo Kick","Pure Energy","Karate Brick Break","Cryogenic Freeze","Deus Sword","Pure Energy",1,"44/52"]
[{"$nulls":8},347,"Pure Metal",5,"Pure","Metal",null,null,"Stunning Hit","Rust","Karate Brick Break","Cannon Balls","Deus Sword","Cannon Balls","Ninja Stars","Pure Light",1,"44/52"]
[{"$nulls":8},348,"Pure Nature",5,"Pure","Nature",null,null,"Head Butt","Leaf Blast","Hammer Fist","Rottening Spell","Karate Brick Break","Rottening Spell","Deus Sword","Pure Energy",1,"44/52"]
[{"$nulls":8},349,"Pure Sea",5,"Pure","Sea",null,null,"Head Butt","Storm","Hammer Fist","Acid Rain","Judo Kick","Whirlpool","Karate Brick Break","Hypnosis",1,"44/52"]
[{"$nulls":8},350,"Pure Terra",5,"Pure","Terra",null,null,"Head Butt","Tumble Weed","Hammer Fist","Asteroid","Karate Brick Break","Sand Storm","Deus Sword","Hypnosis",1,"44/52"]
[{"$nulls":8},351,"Pyre",4,"Metal","Flame","Dark",null,"Karate Brick Break","Rust","Lava Balls","The Grim Reaper","Deus Sword","Ninja Stars","Magma Storm","Black Hole",0,"23"]
[{"$nulls":8},352,"Quake",4,"Terra","Sea","War",null,"Stunning Hit","Earthquake","Tsunami","Giant Crack","Asteroid","Karate Brick Break","Acid Rain","Astro Hit",1,"39/47"]
[{"$nulls":8},353,"Quartz",4,"Terra","Ice","Nature",null,"Head Butt","Earthquake","Ice Spikes","Leaf Blast","Karate Brick Break","Asteroid","Icy Wind","Rottening Spell",0,"17"]
[{"$nulls":8},354,"Queen",4,"Metal","Nature",null,null,"Hard Charge","Poison Ivy","Head Butt","Nail Rain","Head Butt","Rottening Spell","Karate Brick Break","Rust",0,24]
[{"$nulls":8},355,"Quetzal",4,"Nature","Flame",null,null,"Hard Charge","Poison Ivy","Head Butt","Nuclear Hit","Judo Kick","Leaf Blast","Hammer Fist","Flamethrower",0,24]
[{"$nulls":8},356,"Ragnor",5,"Flame","Pure",null,null,"Head Butt","Flaming Arrows","Nuclear Hit","Pure Energy","Deus Sword","Flamethrower","Magma Storm","Pure Light",0,"23"]
[{"$nulls":8},357,"Rainbow",4,"Light","Metal",null,null,"Punch","Light Sword","Stunning Hit","Rust","Karate Brick Break","Enlightning Wisdom","Deus Sword","Ninja Stars",1,"20/28"]
[{"$nulls":8},358,"Ranoldo",3,"Terra","Dark","Electric",null,"Hard Charge","Tumble Weed","Ghost Cloud","Electric Shock","Karate Brick Break","Sand Storm","Black Hole","Tesla Ray",0,"22"]
[{"$nulls":8},359,"Rapunzel",4,"Dark","Nature","Ice",null,"Punch","Tumble Weed","Stitching Roots","Ice Spikes","Hammer Fist","Asteroid","Bee Hive","Icy Wind",0,"23"]
[{"$nulls":8},360,"Rattlesnake",3,"Dark","Nature",null,null,"Hard Charge","Leech","Poison Ivy","Ghost Cloud","Head Butt","Rottening Spell","Hammer Fist","The Grim Reaper",1,"9/15"]
[{"$nulls":8},361,"Recycling",4,"Terra","Sea","Nature",null,"Flying Kick","Earthquake","Flooding","Leaf Blast","Hammer Fist","Asteroid","Acid Rain","Rottening Spell",0,"23"]
[{"$nulls":8},362,"Red Egg",4,"Flame","Terra","Pure",null,"Punch","Flaming Arrows","Meteor Shower","Pure Energy","Hammer Fist","Flamethrower","Asteroid","Pure Light",0,"23"]
[{"$nulls":8},363,"Red Rose",4,"Beauty","Chaos",null,null,"Judo Kick","Floral Coup","Destiny Chains","Bright Aura","Karate Brick Break","Deus Sword","Grace Touch","Disorder",1,"16/24"]
[{"$nulls":8},364,"Red Woods",4,"War","Nature",null,null,"Punch","Giant Mouth","Stunning Hit","Leaf Blast","Hammer Fist","Astro Hit","Karate Brick Break","Bee Hive",1,"32/40"]
[{"$nulls":8},365,"Rem",5,"War","Dark","Pure",null,"Head Butt","Giant Mouth","Ghost Cloud","Pure Energy","Deus Sword","Astro Hit","Black Hole","Pure Light",0,"23"]
[{"$nulls":8},366,"Robin Hood",4,"Legend",{"$nulls":3},"Hard Charge","Legendary Wind","Stunning Hit","Paralyzing Spell","Karate Brick Break","Aurora Borealis","Deus Sword","Legend Spell",0,"17"]
[{"$nulls":8},367,"Robot",2,"Flame","Metal",null,null,"Flying Kick","Magneto","Head Butt","Laser Beam","Hammer Fist","Cannon Balls","Karate Brick Break","Flamethrower",0,"15"]
[{"$nulls":8},368,"Rockfeller",4,"Dark","Metal",null,null,"Punch","Life Drain","Stunning Hit","Rust","The Grim Reaper","Cannon Balls","Black Hole","Ninja Stars",0,"17"]
[{"$nulls":8},369,"Rockfire",5,"Legend",{"$nulls":3},"Head Butt","Legendary Wind","Paralyzing Spell","Rainbow","Karate Brick Break","Deus Sword","Aurora Borealis","Legend Spell",0,"58"]
[{"$nulls":8},370,"Rockstar",4,"Dark","Metal","Electric",null,"Judo Kick","Leech","Magneto","Electric Shock","Karate Brick Break","The Grim Reaper","Ninja Stars","Tesla Ray",0,"17"]
[{"$nulls":8},371,"Rorschach",8,"Light","Nature","War",null,"Flying Kick","Light Sword","Leaf Blast","Giant Claw","Light Prism","Rottening Spell","Astro Hit","War Fist",0,"24"]
[{"$nulls":8},372,"Ruby",4,"Metal","Flame",null,null,"Hard Charge","Flamethrower","Nail Rain","Hammer Fist","Karate Brick Break","Magma Storm","Cannon Balls","Deus Sword",1,"16/24"]
[{"$nulls":8},373,"Rudolph",5,"Terra","Light",null,null,"Stunning Hit","Earthquake","Meteor Shower","Light Star","Karate Brick Break","Asteroid","Sand Storm","Out of Time",0,"23"]
[{"$nulls":8},374,"Sackman",4,"Legend",{"$nulls":3},"Flying Kick","Legendary Wind","Stunning Hit","Paralyzing Spell","Head Butt","Aurora Borealis","Deus Sword","Legend Spell",0,"40"]
[{"$nulls":8},375,"Sad",5,"Terra","Dark",null,null,"Hard Charge","Meteor Shower","Tumble Weed","Leech","Hammer Fist","Asteroid","Sand Storm","Black Hole",0,"23"]
[{"$nulls":8},376,"Sakura",4,"Light","Sea","Terra",null,"Punch","Light Sword","Flooding","Asteroid","Judo Kick","Enlightning Wisdom","Whirlpool","Sand Storm",0,"23"]
[{"$nulls":8},377,"Samba",4,"Light","Flame","War",null,"Judo Kick","Light Prism","Flaming Arrows","Giant Claw","Deus Sword","Enlightning Wisdom","Magma Storm","War Fist",0,"23"]
[{"$nulls":8},378,"Sand",4,"Flame","Terra","Light",null,"Hammer Fist","Flaming Arrows","Earthquake","Light Star","Deus Sword","Flamethrower","Asteroid","Enlightning Wisdom",0,"23"]
[{"$nulls":8},379,"Santa",5,"Ice","Terra",null,null,"Hard Charge","Earthquake","Head Butt","Ice Spikes","Judo Kick","Tumble Weed","Hammer Fist","Icy Wind",0,"15"]
[{"$nulls":8},380,"Sap",5,"Legend",{"$nulls":3},"Punch","Legendary Wind","Head Butt","Paralyzing Spell","Hammer Fist","Rainbow","Karate Brick Break","Legend Spell",0,"58"]
[{"$nulls":8},381,"Saturn",4,"Sea","Ice","Light",null,"Stunning Hit","Tsunami","Frost Nova","Light Sword","Deus Sword","Whirlpool","Cryogenic Freeze","Light Star",0,23]
[{"$nulls":8},382,"Scientific",4,"Terra","Electric","Pure",null,"Punch","Earthquake","Laser Beam","Pure Energy","Hammer Fist","Asteroid","Tesla Ray","Pure Light",0,23]
[{"$nulls":8},383,"Scrooge",4,"Ice","Dark",null,null,"Judo Kick","Snow Storm","Punch","Leech","Icy Wind","Black Hole","Cryogenic Freeze","The Grim Reaper",0,"17"]
[{"$nulls":8},384,"Sea",1,"Sea"," ",null,null,"Punch","Tsunami","Flooding","Storm","Hard Charge","Head Butt","Acid Rain","Whirlpool",1,"30s/30s"]
[{"$nulls":8},385,"Seafloor",3,"Terra","Sea","Light",null,"Head Butt","Meteor Shower","Flooding","Light Star","Hammer Fist","Sand Storm","Acid Rain","Enlightning Wisdom",0,"16"]
[{"$nulls":8},386,"Seahorse",3,"Sea","Nature",null,null,"Hard Charge","Flooding","Head Butt","Leaf Blast","Judo Kick","Storm","Hammer Fist","Rottening Spell",1,"16/24"]
[{"$nulls":8},387,"Seashell",3,"Sea","Metal",null,null,"Hard Charge","Flooding","Stunning Hit","Magneto","Head Butt","Storm","Judo Kick","Cannon Balls",1,"9/15"]
[{"$nulls":8},388,"Secret Fire",4,"Magic","Chaos",null,null,"Head Butt","Magic Blow","Destiny Chains","Mana Lightnings","Karate Brick Break","Deus Sword","Vigor Feel","Disorder",1,"16/24"]
[{"$nulls":8},389,"Sensei",4,"Terra","Light","Pure",null,"Hard Charge","Earthquake","Light Sword","Hypnosis","Karate Brick Break","Sand Storm","Light Prism","Pure Light",0,"23"]
[{"$nulls":8},390,"Sentence",9,"War","Dark","Metal ","Flame","Giant Mouth","Ghost Cloud","Cannon Balls","Lava Balls","Astro Hit","Black Hole","Ninja Stars","Flamethrower",0,"58"]
[{"$nulls":8},391,"Shakespeare",4,"Terra","Dark","Metal",null,"Head Butt","Meteor Shower","Leech","Magneto","Karate Brick Break","Asteroid","Black Hole","Ninja Stars",0,"23"]
[{"$nulls":8},392,"Shaolin",4,"Terra","Flame","War",null,"Judo Kick","Tumble Weed","Lava Balls","Giant Crack","Karate Brick Break","Asteroid","Flamethrower","Astro Hit",0,"23"]
[{"$nulls":8},393,"Sheep",6,"Ice","Dark","War",null,"Hard Charge","Snow Storm","The Grim Reaper","Giant Crack","Judo Kick","Icy Wind","Black Hole","Giant Claw",0,"23"]
[{"$nulls":8},394,"Sheriff",3,"Terra","Nature",null,null,"Stunning Hit","Meteor Shower","Tumble Weed","Leaf Blast","Karate Brick Break","Asteroid","Sand Storm","Bee Hive",0,"17"]
[{"$nulls":8},395,"Shogun",5,"Metal","Flame","War",null,"Hard Charge","Nail Rain","Flaming Arrows","Giant Crack","Deus Sword","Flamethrower","Ninja Stars","War Fist",0,"22"]
[{"$nulls":8},396,"Sky",4,"Terra","Electric",null,null,"Stunning Hit","Meteor Shower","Head Butt","Electric Shock","Judo Kick","Tumble Weed","Karate Brick Break","Electro Ball",1,"16/24"]
[{"$nulls":8},397,"Sky Queen",6,"Ice","War","Pure",null,"Punch","Ice Spikes","Giant Crack","Pure Energy","Head Butt","Icy Wind","Astro Hit","Pure Light",0,"23"]
[{"$nulls":8},398,"Sleeping Beauty",4,"Terra","Light","Pure",null,"Punch","Earthquake","Light Prism","Hypnosis","Karate Brick Break","Asteroid","Enlightning Wisdom","Pure Energy",0,"23"]
[{"$nulls":8},399,"Snail",4,"Terra","Nature","Flame",null,"Head Butt","Meteor Shower","Rottening Spell","Flamethrower","Karate Brick Break","Sand Storm","Bee Hive","Magma Storm",0,"17"]
[{"$nulls":8},400,"Snow Man",4,"Ice","Nature",null,null,"Hard Charge","Snow Storm","Head Butt","Stitching Roots","Hammer Fist","Icy Wind","Bee Hive","Cryogenic Freeze",0,"17"]
[{"$nulls":8},401,"Snowflake",3,"Terra","Ice",null,null,"Hard Charge","Earthquake","Head Butt","Ice Spikes","Judo Kick","Tumble Weed","Hammer Fist","Icy Wind",1,"9/15"]
[{"$nulls":8},402,"Soccer",4,"Ice","Flame",null,null,"Stunning Hit","Ice Spikes","Nuclear Hit","Snow Storm","Judo Kick","Icy Wind","Magma Storm","Cryogenic Freeze",1,"9/15"]
[{"$nulls":8},403,"Soldier",4,"Terra","Flame","Dark",null,"Stunning Hit","Meteor Shower","Flaming Arrows","Ghost Cloud","Hammer Fist","Asteroid","Flamethrower","The Grim Reaper",0,23]
[{"$nulls":8},404,"Sorcerer",4,"Ice","Dark","War",null,"Head Butt","Snow Storm","Ghost Cloud","Giant Claw","Deus Sword","Cryogenic Freeze","Black Hole","War Fist",0,"23"]
[{"$nulls":8},405,"Soul Eater",4,"Sea","Light","Dark",null,"Flying Kick","Tsunami","Light Prism","Leech","Hard Charge","Whirlpool","Out of Time","Black Hole",0,23]
[{"$nulls":8},406,"Space",5,"Sea","War","Dark",null,"Stunning Hit","Tsunami","Giant Crack","Ghost Cloud","Hammer Fist","Acid Rain","War Fist","The Grim Reaper",0,"36"]
[{"$nulls":8},407,"Spark",3,"Electric","Sea",null,null,"Head Butt","Lightning","Flooding","Laser Beam","Karate Brick Break","Electric Shock","Whirlpool","Electro Ball",0,"17"]
[{"$nulls":8},408,"Spartan",4,"Dark","Terra","War",null,"Hard Charge","Ghost Cloud","Tumble Weed","Giant Claw","Stunning Hit","Black Hole","Asteroid","War Fist",0,"23"]
[{"$nulls":8},409,"Specter",4,"Sea","Electric","Dark",null,"Flying Kick","Flooding","Lightning","Ghost Cloud","Hammer Fist","Acid Rain","Electro Ball","The Grim Reaper",0,"17"]
[{"$nulls":8},410,"Speed",4,"Terra","Flame","Metal",null,"Hard Charge","Earthquake","Lava Balls","Rust","Hammer Fist","Asteroid","Flamethrower","Cannon Balls",0,"23"]
[{"$nulls":8},411,"Sphynx",4,"Electric","Flame",null,null,"Judo Kick","Lightning","Lava Balls","Flaming Arrows","Karate Brick Break","Electric Shock","Electro Ball","Flamethrower",0,"17"]
[{"$nulls":8},412,"Spicy",2,"Flame","Nature",null,null,"Flying Kick","Lava Balls","Poison Ivy","Stunning Hit","Stunning Hit","Nuclear Hit","Rottening Spell","Judo Kick",1,"7/13"]
[{"$nulls":8},413,"Spiky",5,"Flame","Pure",null,null,"Head Butt","Flaming Arrows","Nuclear Hit","Hypnosis","Karate Brick Break","Flamethrower","Magma Storm","Pure Light",0,"23"]
[{"$nulls":8},414,"Spring",4,"Nature","Terra","Light",null,"Head Butt","Stitching Roots","Meteor Shower","Light Prism","Karate Brick Break","Bee Hive","Tumble Weed","Enlightning Wisdom",0,"23"]
[{"$nulls":8},415,"St Patrick's",4,"Nature","Electric",{"$nulls":10},0]
[{"$nulls":8},416,"Star",2,"Terra","Electric",null,null,"Flying Kick","Earthquake","Laser Beam","Meteor Shower","Hard Charge","Tumble Weed","Electro Ball","Asteroid",1,"7/9"]
[{"$nulls":8},417,"Steam",4,"Sea","Flame","Ice",null,"Head Butt","Tsunami","Flaming Arrows","Frost Nova","Whirlpool","Magma Storm","Hammer Fist","Cryogenic Freeze",1,"39/47"]
[{"$nulls":8},418,"Steampunk",2,"Flame","Metal",null,null,"Flying Kick","Flaming Arrows","Hard Charge","Magneto","Stunning Hit","Nuckear Hit","Judo Kick","Rust",1,"13/19"]
[{"$nulls":8},419,"Storm",2,"Sea","Electric",null,null,"Hard Charge","Flooding","Head Butt","Laser Beam","Stunning Hit","Storm","Hammer Fist","Electro Ball",1,"9/15"]
[{"$nulls":8},420,"Stressed",4,"Nature","Electric",null,null,"Punch","Stitching Roots","Poison Ivy","Lightning","Hammer Fist","Rottening Spell","Bee Hive","Electro Ball",0,23]
[{"$nulls":8},421,"Strong",4,"Terra","Metal","War",null,"Punch","Earthquake","Rust","Giant Claw","Hammer Fist","Asteroid","Cannon Balls","Astro Hit",0,"23"]
[{"$nulls":8},422,"Summer",4,"Ice","Nature","Light",null,"Punch","Frost Nova","Poison Ivy","Enlightning Wisdom","Head Butt","Cryogenic Freeze","Bee Hive","Out of Time",0,"23"]
[{"$nulls":8},423,"Sun",4,"Light","Flame",null,null,"Punch","Light Star","Hard Charge","Nuclear Hit","Deus Sword","Out of Time","Hammer Fist","Magma Storm",1,"20/28"]
[{"$nulls":8},424,"Sunset",4,"Flame","Metal","Dark",null,"Head Butt","Lava Balls","Magneto","Ghost Cloud","Hammer Fist","Flamethrower","Cannon Balls","The Grim Reaper",0,"23"]
[{"$nulls":8},425,"Supernova",4,"Light","Dark","Electric",null,"Punch","Light Sword","Ghost Cloud","Electro Ball","Judo Kick","Light Prism","Black Hole","Tesla Ray",0,"23"]
[{"$nulls":8},426,"Supersonic",5,"Nature","Electric","Terra","Metal","Stitching Roots","Lightning","Meteor Shower","Magneto","Rottening Spell","Tesla Ray","Sand Storm","Ninja Stars",1,"77.5/87.5"]
[{"$nulls":8},427,"Surf",3,"Nature","Sea",null,null,"Punch","Leaf Blast","Flooding","Storm","Hammer Fist","Bee Hive","Acid Rain","Whirlpool",0,17]
[{"$nulls":8},428,"Sylvan",4,"Nature","War",null,null,"Head Butt","Leaf Blast","Judo Kick","Giant Crack","Deus Sword","Astro Hit","Bee Hive","War Fist",1,"58/68"]
[{"$nulls":8},429,"Terra",1,"Terra"," ",null,null,"Punch","Earthquake","Meteor Shower","Tumble Weed","Hard Charge","Tumble Weed","Judo Kick","Sand Storm",1,"15s/15s"]
[{"$nulls":8},430,"Tesla",4,"War","Electric",null,null,"Punch","Giant Claw","Hard Charge","Lightning","Astro Hit","Electro Ball","War Fist","Tesla Ray",1,"32/40"]
[{"$nulls":8},431,"Thanksgiving",3,"Flame","Sea",null,null,"Hard Charge","Flaming Arrows","Flooding","Nuclear Hit","Head Butt","Nuclear Hit","Acid Rain","Flamethrower",0,24]
[{"$nulls":8},432,"The Amazing",4,"Happy","Soul",null,null,"Stunning Hit","Brilliant Firework","Celestial Hand","Festive Lights","Karate Brick Break","Deus Sword","Appeal","Supernatural",1,"16/24"]
[{"$nulls":8},433,"Thief",4,"Terra","Dark",null,null,"Flying Kick","Earthquake","Stunning Hit","Life Drain","Hammer Fist","Sand Storm","Karate Brick Break","The Grim Reaper",0,"17"]
[{"$nulls":8},434,"Thor",4,"War","Flame",null,null,"Hard Charge","Giant Crack","Head Butt","Flaming Arrows","Hammer Fist","War Fist","Karate Brick Break","Flamethrower",0,"17"]
[{"$nulls":8},435,"Tiny",4,"Nature","Light",null,null,"Flying Kick","Poison Ivy","Stunning Hit","Light Star","Karate Brick Break","Bee Hive","Deus Sword","Out of Time",1,"11/17"]
[{"$nulls":8},436,"Titan",9,"Legend","Chaos",null,null,"Hammer Fist","Paralyzing Spell","Rainbow","Destiny Chains","Iron Shock","Aurora Borealis","Legend Spell","Disorder",0,"58"]
[{"$nulls":8},437,"Touchdown",4,"Terra","Flame","War",null,"Head Butt","Meteor Shower","Nuclear Hit","Giant Mouth","Karate Brick Break","Sand Storm","Magma Storm","Astro Hit",0,"23"]
[{"$nulls":8},438,"Toxic",4,"Electric","Dark",null,null,"Flying Kick","Laser Beam","Stunning Hit","Leech","Hammer Fist","Electro Ball","Karate Brick Break","Black Hole",0,"17"]
[{"$nulls":8},439,"Treasure",4,"Metal","Terra",null,null,"Hard Charge","Magneto","Stunning Hit","Electric Shock","Hammer Fist","Cannon Balls","Karate Brick Break","Electro Ball",1,"11/17"]
[{"$nulls":8},440,"T-Rex",4,"Flame","Electric",null,null,"Stunning Hit","Flaming Arrows","Meteor Shower","Nuclear Hit","Hammer Fist","Asteroid","Rottening Spell","Sand Storm",0,"15"]
[{"$nulls":8},441,"Tribal",4,"Nature","Terra",null,null,"Hard Charge","Stitching Roots","Stunning Hit","Earthquake","Hammer Fist","Rottening Spell","Karate Brick Break","Sand Storm",0,"17"]
[{"$nulls":8},442,"Troglodyte",4,"Terra","Flame","Metal",null,"Hard Charge","Earthquake","Lava Balls","Rust","Hammer Fist","Asteroid","Flamethrower","Cannon Balls",0,23]
[{"$nulls":8},443,"Tropical",2,"Terra","Nature",null,null,"Flying Kick","Earthquake","Poison Ivy","Meteor Shower","Stunning Hit","Tumble Weed","Rottening Spell","Asteroid",1,"7/13"]
[{"$nulls":8},444,"Twin",3,"Flame","Ice","Light",null,"Stunning Hit","Flaming Arrows","Snow Storm","Light Prism","Karate Brick Break","Flamethrower","Cryogenic Freeze","Out of Time",0,"23"]
[{"$nulls":8},445,"Twister",4,"Dark","Sea",null,null,"Flying Kick","Tsunami","Stunning Hit","Ghost Cloud","Acid Rain","The Grim Reaper","Whirlpool","Black Hole",0,"17"]
[{"$nulls":8},446,"Two-Headed",4,"Nature","Dark",{"$nulls":10},1]
[{"$nulls":8},447,"Ukulele",3,"Nature","Terra","Pure",null,"Hard Charge","Poison Ivy","Meteor Shower","Pure Light","Deus Sword","Rottening Spell","Sand Storm","Pure Energy",0,17]
[{"$nulls":8},448,"Uncle Sam",3,"Electric","Metal",null,null,"Hard Charge","Laser Beam","Stunning Hit","Rust","Head Butt","Electric Shock","Karate Brick Break","Cannon Balls",0,"15"]
[{"$nulls":8},449,"Underworld",6,"Chaos","Soul",null,null,"Head Butt","Celestial Hand","Destiny Chains","Soul Breaker","Karate Brick Break","Deus Sword","Supernatural","Disorder",1,"16/24"]
[{"$nulls":8},450,"Unity",4,"Ice","Dark","Sea",null,"Flying Kick","Frost Nova","Ghost Cloud","Storm","Icy Wind","Black Hole","Cryogenic Freeze","Whirlpool",1,"58/68"]
[{"$nulls":8},451,"Vampire",2,"Flame","Dark",null,null,"Flying Kick","Lava Balls","Leech","Flaming Arrows","Stunning Hit","Nuclear Hit","Ghost Cloud","Flamethrower",1,"13/19"]
[{"$nulls":8},452,"Venetian",4,"Dark","Sea","Flame",null,"Head Butt","Leech","Flooding","Nuclear Hit","Karate Brick Break","The Grim Reaper","Acid Rain","Magma Storm",0,"23"]
[{"$nulls":8},453,"Venom",3,"Terra","Dark",null,null,"Stunning Hit","Meteor Shower","Head Butt","Ghost Cloud","Judo Kick","Asteroid","Hammer Fist","The Grim Reaper",1,"9/15"]
[{"$nulls":8},454,"Viking",4,"Ice","Sea",null,null,"Stunning Hit","Ice Spikes","Head Butt","Storm","Judo Kick","Snow Storm","Karate Brick Break","Acid Rain",1,"16/24"]
[{"$nulls":8},455,"Void",4,"Dark","Pure","Metal","War","Leech","Pure Energy","Magneto","Giant Claw","Black Hole","Pure Light","Cannon Balls","Astro Hit",0,"40"]
[{"$nulls":8},456,"Volcano",3,"Flame","Terra",null,null,"Hard Charge","Flaming Arrows","Meteor Shower","Nuclear Hit","Head Butt","Nuclear Hit","Asteroid","Flamethrower",1,"1m/1m"]
[{"$nulls":8},457,"Voodoo Witcher",4,"Dark","Nature","Metal",null,"Stunning Hit","The Grim Reaper","Poison Ivy","Nail Rain","Deus Sword","Black Hole","Bee Hive","Magneto",0,23]
[{"$nulls":8},458,"War",4,"War",{"$nulls":3},"Flying Kick","Giant Crack","Stunning Hit","Giant Mouth","Karate Brick Break","Astro Hit","Deus Sword","War Fist",1,"5/7"]
[{"$nulls":8},459,"Waterfall",2,"Terra","Sea",null,null,"Hard Charge","Earthquake","Stunning Hit","Storm","Head Butt","Tumble Weed","Judo Kick","Acid Rain",1,"4/4"]
[{"$nulls":8},460,"Wave",4,"Sea","Electric","Light",null,"Hard Charge","Tsunami","Electric Shock","Light Star","Hammer Fist","Flooding","Tesla Ray","Enlightning Wisdom",0,23]
[{"$nulls":8},461,"White Knight",4,"Light","Terra",null,null,"Stunning Hit","Light Sword","Hard Charge","Earthquake","Out of Time","Asteroid","Enlightning Wisdom","Sand Storm",0,"17"]
[{"$nulls":8},462,"Wind",5,"Legend",{"$nulls":3},"Head Butt","Legendary Wind","Paralyzing Spell","Judo Kick","Hammer Fist","Rainbow","Aurora Borealis","Deus Sword",1,"50/58"]
[{"$nulls":8},463,"Wizard",4,"Terra","Dark",null,null,"Stunning Hit","Meteor Shower","Head Butt","Ghost Cloud","Judo Kick","Asteroid","Hammer Fist","The Grim Reaper",1,"24"]
[{"$nulls":8},464,"Wonder",4,"Light","Pure","Electric",null,"Flying Kick","Light Sword","Hypnosis","Lightning","Hard Charge","Light Prism","Pure Energy","Electric Shock",0,"40"]
[{"$nulls":8},465,"Wrestler",5,"Terra","Flame","War",null,"Hard Charge","Meteor Shower","Flaming Arrows","Giant Crack","Karate Brick Break","Asteroid","Flamethrower","War Fist",0,"17"]
[{"$nulls":8},466,"Wurm",4,"Nature","Terra",null,null,"Stunning Hit","Poison Ivy","Head Butt","Tumble Weed","Hammer Fist","Bee Hive","Asteroid","Sand Storm",0,17]
[{"$nulls":8},467,"Wyvern",4,"Dark","Flame","Terra",null,"Punch","Life Drain","Flaming Arrows","Tumble Weed","Karate Brick Break","The Grim Reaper","Flamethrower","Sand Storm",1,"11/17"]
[{"$nulls":8},468,"Xmas Elf",4,"Nature","Ice",null,null,"Flying Kick","Leaf Blast","Judo Kick","Ice Spikes","Karate Brick Break","Cryogenic Freeze","Rottening Spell","Icy Wind",0,"17"]
[{"$nulls":8},469,"Yôkai",4,"Dark","Light","Electric",null,"Hammer Fist","Life Drain","Light Prism","Lightning","Deus Sword","The Grim Reaper","Out Of Time","Electro Ball",0,"23"]
[{"$nulls":8},470,"Zen",4,"Light","Pure",null,null,"Stunning Hit","Light Prism","Judo Kick","Light Star","Enlightning Wisdom","Hypnosis","Out Of Time","Pure Light",1,"32/40"]
[{"$nulls":8},471,"Zizou",3,"Terra","Light","Pure",null,"Head Butt","Earthquake","Light Star","Hypnosis","Karate Brick Break","Asteroid","Light Sword","Pure Light",0,"22"]
[{"$nulls":8},472,"Zodiac Aquarius",4,"Ice","War","Electric",null,"Stunning Hit","Frost Nova","Giant Claw","Lightning","Icy Wind","Astro Hit","Cryogenic Freeze","Electro Ball",0,"23"]
[{"$nulls":8},473,"Zodiac Cancer",4,"Sea","Dark","Electric",null,"Head Butt","Flooding","Life Drain","Laser Beam","Acid Rain","The Grim Reaper","Whirlpool","Electro Ball",0,"23"]
[{"$nulls":8},474,"Zodiac Capricorn",4,"Terra","War","Electric",null,"Hard Charge","Earthquake","Giant Mouth","Electric Shock","Asteroid","War Fist","Sand Storm","Tesla Ray",0,"23"]
[{"$nulls":8},475,"Zodiac Gemini",4,"Ice","Dark","Electric",null,"Flying Kick","Snow Storm","Ghost Cloud","Electric Shock","Icy Wind","The Grim Reaper","Cryogenic Freeze","Tesla Ray",0,"23"]
[{"$nulls":8},476,"Zodiac Leo",4,"Flame","Light","Electric",null,"Hard Charge","Lava Balls","Light Star","Lightning","Flamethrower","Out of Time","Magma Storm","Electro Ball",0,"23"]
[{"$nulls":8},477,"Zodiac Libra",4,"Ice","Light","Electric",null,"Stunning Hit","Ice Spikes","Light Prism","Lightning","Icy Wind","Out of Time","Cryogenic Freeze","Tesla Ray",0,"23"]
[{"$nulls":8},478,"Zodiac Pisces",4,"Sea","War","Electric",null,"Head Butt","Tsunami","Giant Mouth","Lightning","Acid Rain","War Fist","Whirlpool","Electro Ball",0,"23"]
[{"$nulls":8},479,"Zodiac Sagittarius",4,"Flame","War","Electric",null,"Punch","Flaming Arrows","Giant Crack","Laser Beam","Flamethrower","Astro Hit","Magma Storm","Electro Ball",0,"23"]
[{"$nulls":8},480,"Zodiac Scorpio",4,"Sea","Light","Electric",null,"Hard Charge","Tsunami","Light Prism","Electric Shock","Acid Rain","Enlightning Wisdom","Whirlpool","Electro Ball",0,"23"]
[{"$nulls":8},481,"Zodiac Taurus",4,"Terra","Dark","Electric",null,"Stunning Hit","Earthquake","Life Drain","Electric Shock","Hammer Fist","Asteroid","The Grim Reaper","Electro Ball",0,"23"]
[{"$nulls":8},482,"Zodiac Virgo",4,"Terra","Light","Electric",null,"Punch","Tumble Weed","Light Sword","Electric Shock","Karate Brick Break","Asteroid","Enlightning Wisdom","Tesla Ray",0,"23"]
[{"$nulls":8},483,"Zombie",2,"Metal","Dark",null,null,"Flying Kick","Nail Rain","Leech","Magneto","Stunning Hit","Rust","Ghost Cloud","The Grim Reaper",1,"9/15"]
[{"$nulls":8},484]
[{"$nulls":8},485]
[{"$nulls":8},486]
[{"$nulls":8},487]
[{"$nulls":8},488]
[{"$nulls":8},489]
[{"$nulls":8},490]
[{"$nulls":8},491]
[{"$nulls":8},492]
[{"$nulls":8},493]
[{"$nulls":8},494]
[{"$nulls":8},495]
[{"$nulls":8},496]
[{"$nulls":8},497]
[{"$nulls":8},498]
[{"$nulls":8},499]
[{"$nulls":8},500]
[{"$nulls":8},501]
[{"$nulls":8},502]
[{"$nulls":8},503]
[{"$nulls":8},504]
[{"$nulls":8},505]
[{"$nulls":8},506]
[{"$nulls":8},507]
[{"$nulls":8},508]
[{"$nulls":8},509]
[{"$nulls":8},510]
[{"$nulls":8},511]
[{"$nulls":8},512]
[{"$nulls":8},513]
[{"$nulls":8},514]
[{"$nulls":8},515]
[{"$nulls":8},516]
[{"$nulls":8},517]
[{"$nulls":8},518]
[{"$nulls":8},519]
[{"$nulls":8},520]
[{"$nulls":8},521]
[{"$nulls":8},522]
[{"$nulls":8},523]
[{"$nulls":8},524]
[{"$nulls":8},525]
[{"$nulls":8},526]
[{"$nulls":8},527]
[{"$nulls":8},528]
[{"$nulls":8},529]
[{"$nulls":8},530]
[{"$nulls":8},531]
[{"$nulls":8},532]
[{"$nulls":8},533]
[{"$nulls":8},534]
[{"$nulls":8},535]
[{"$nulls":8},536]
[{"$nulls":8},537]
[{"$nulls":8},538]
[{"$nulls":8},539]
[{"$nulls":8},540]
[{"$nulls":8},541]
[{"$nulls":8},542]
[{"$nulls":8},543]
[{"$nulls":8},544]
[{"$nulls":8},545]
[{"$nulls":8},546]
[{"$nulls":8},547]
[{"$nulls":8},548]
[{"$nulls":8},549]
[{"$nulls":8},550]
[{"$nulls":8},551]
[{"$nulls":8},552]
[{"$nulls":8},553]
[{"$nulls":8},554]
[{"$nulls":8},555]
[{"$nulls":8},556]
[{"$nulls":8},557]
[{"$nulls":8},558]
[{"$nulls":8},559]
[{"$nulls":8},560]
[{"$nulls":8},561]
[{"$nulls":8},562]
[{"$nulls":8},563]
[{"$nulls":8},564]
[{"$nulls":8},565]
[{"$nulls":8},566]
[{"$nulls":8},567]
[{"$nulls":8},568]
[{"$nulls":8},569]
[{"$nulls":8},570]
[{"$nulls":8},571]
[{"$nulls":8},572]
[{"$nulls":8},573]
[{"$nulls":8},574]
[{"$nulls":8},575]
[{"$nulls":8},576]
[{"$nulls":8},577]
[{"$nulls":8},578]
[{"$nulls":8},579]
[{"$nulls":8},580]
[{"$nulls":8},581]
[{"$nulls":8},582]
[{"$nulls":8},583]
[{"$nulls":8},584]
[{"$nulls":8},585]
[{"$nulls":8},586]
[{"$nulls":8},587]
[{"$nulls":8},588]
[{"$nulls":8},589]
[{"$nulls":8},590]
[{"$nulls":8},591]
[{"$nulls":8},592]
[{"$nulls":8},593]
[{"$nulls":8},594]
[{"$nulls":8},595]
[{"$nulls":8},596]
[{"$nulls":8},597]
[{"$nulls":8},598]
[{"$nulls":8},599]
[{"$nulls":8},600]
[{"$nulls":8},601]
[{"$nulls":8},602]
[{"$nulls":8},603]
[{"$nulls":8},604]
[{"$nulls":8},605]
[{"$nulls":8},606]
[{"$nulls":8},607]
[{"$nulls":8},608]
[{"$nulls":8},609]
[{"$nulls":8},610]
[{"$nulls":8},611]
[{"$nulls":8},612]
[{"$nulls":8},613]
[{"$nulls":8},614]
[{"$nulls":8},615]
[{"$nulls":8},616]
[{"$nulls":8},617]
[{"$nulls":8},618]
[{"$nulls":8},619]
[{"$nulls":8},620]
[{"$nulls":8},621]
[{"$nulls":8},622]
[{"$nulls":8},623]
[{"$nulls":8},624]
[{"$nulls":8},625]
[{"$nulls":8},626]
[{"$nulls":8},627]
[{"$nulls":8},628]
[{"$nulls":8},629]
[{"$nulls":8},630]
[{"$nulls":8},631]
[{"$nulls":8},632]
[{"$nulls":8},633]
[{"$nulls":8},634]
[{"$nulls":8},635]
[{"$nulls":8},636]
[{"$nulls":8},637]
[{"$nulls":8},638]
[{"$nulls":8},639]
[{"$nulls":8},640]
[{"$nulls":8},641]
[{"$nulls":8},642]
[{"$nulls":8},643]
[{"$nulls":8},644]
[{"$nulls":8},645]
[{"$nulls":8},646]
[{"$nulls":8},647]
[{"$nulls":8},648]
[{"$nulls":8},649]
[{"$nulls":8},650]
[{"$nulls":8},651]
[{"$nulls":8},652]
[{"$nulls":8},653]
[{"$nulls":8},654]
[{"$nulls":8},655]
[{"$nulls":8},656]
[{"$nulls":8},657]
[{"$nulls":8},658]
[{"$nulls":8},659]
[{"$nulls":8},660]
[{"$nulls":8},661]
[{"$nulls":8},662]
[{"$nulls":8},663]
[{"$nulls":8},664]
[{"$nulls":8},665]
[{"$nulls":8},666]
[{"$nulls":8},667]
[{"$nulls":8},668]
[{"$nulls":8},669]
[{"$nulls":8},670]
[{"$nulls":8},671]
[{"$nulls":8},672]
[{"$nulls":8},673]
[{"$nulls":8},674]
[{"$nulls":8},675]
[{"$nulls":8},676]
[{"$nulls":8},677]
[{"$nulls":8},678]
[{"$nulls":8},679]
[{"$nulls":8},680]
[{"$nulls":8},681]
[{"$nulls":8},682]
[{"$nulls":8},683]
[{"$nulls":8},684]
[{"$nulls":8},685]
[{"$nulls":8},686]
[{"$nulls":8},687]
[{"$nulls":8},688]
[{"$nulls":8},689]
[{"$nulls":8},690]
[{"$nulls":8},691]
[{"$nulls":8},692]
[{"$nulls":8},693]
[{"$nulls":8},694]
[{"$nulls":8},695]
[{"$nulls":8},696]
[{"$nulls":8},697]
[{"$nulls":8},698]
[{"$nulls":8},699]
[{"$nulls":8},700]
[{"$nulls":8},701]
[{"$nulls":8},702]
[{"$nulls":8},703]
[{"$nulls":8},704]
[{"$nulls":8},705]
[{"$nulls":8},706]
[{"$nulls":8},707]
[{"$nulls":8},708]
[{"$nulls":8},709]
[{"$nulls":8},710]
[{"$nulls":8},711]
[{"$nulls":8},712]
[{"$nulls":8},713]
[{"$nulls":8},714]
[{"$nulls":8},715]
[{"$nulls":8},716]
[{"$nulls":8},717]
[{"$nulls":8},718]
[{"$nulls":8},719]
[{"$nulls":8},720]
[{"$nulls":8},721]
[{"$nulls":8},722]
[{"$nulls":8},723]
[{"$nulls":8},724]
[{"$nulls":8},725]
[{"$nulls":8},726]
[{"$nulls":8},727]

{"sheet":"Info","index":4,"n_rows":58,"n_cols":9,"rows_kept":58,"merged":[[1,5,1,7],[2,1,2,2],[16,1,16,2]]}
["Cost of Food"]
[{"$nulls":5},"Cost"]
["Food","Time",null,"Collect","Price","XP","Secs / unit","Gold / unit","XP / unit"]
["Dragon Belle","30s",30,5,50,25,{"$f":"C4/D4","v":{"v":6,"d":"6.00"}},{"$f":"E4/D4","v":{"v":10,"d":"10.00"}},{"$f":"F4/D4","v":{"v":5,"d":"5.00"}}]
["Hot Dragon Chili","5m",{"$f":"5*60","v":300},25,250,250,{"$f":"C5/D5","v":{"v":12,"d":"12.00"}},{"$f":"E5/D5","v":{"v":10,"d":"10.00"}},{"$f":"F5/D5","v":{"v":10,"d":"10.00"}}]
["Caterpillar Lily","30m",{"$f":"30*60","v":{"v":1800,"d":"1,800"}},75,{"v":1000,"d":"1,000"},{"v":1000,"d":"1,000"},{"v":24,"d":"24.00"},{"v":13.333333333333334,"d":"13.33"},{"v":13.333333333333334,"d":"13.33"}]
["Unicorn Horns","2h",{"$f":"2*3600","v":{"v":7200,"d":"7,200"}},200,{"v":5000,"d":"5,000"},{"v":5000,"d":"5,000"},{"v":36,"d":"36.00"},{"v":25,"d":"25.00"},{"v":25,"d":"25.00"}]
["Ladybird Blossom","6h",{"$f":"6*3600","v":{"v":21600,"d":"21,600"}},500,{"v":15000,"d":"15,000"},{"v":15000,"d":"15,000"},{"v":43.2,"d":"43.20"},{"v":30,"d":"30.00"},{"v":30,"d":"30.00"}]
["Rainbow Flower","3h",{"$f":"3*3600","v":{"v":10800,"d":"10,800"}},{"v":2250,"d":"2,250"},{"v":150000,"d":"150,000"},{"v":18750,"d":"18,750"},{"v":4.8,"d":"4.80"},{"v":66.66666666666667,"d":"66.67"},{"v":8.333333333333334,"d":"8.33"}]
["Spike Balls","9h",{"$f":"9*3600","v":{"v":32400,"d":"32,400"}},{"v":10000,"d":"10,000"},{"v":1000000,"d":"1,000,000"},{"v":100000,"d":"100,000"},3.24,{"v":100,"d":"100.00"},{"v":10,"d":"10.00"}]
["Flesh Eaters","12h",{"$f":"12*3600","v":{"v":43200,"d":"43,200"}},{"v":25000,"d":"25,000"},{"v":3000000,"d":"3,000,000"},{"v":150000,"d":"150,000"},{"v":1.728,"d":"1.73"},{"v":120,"d":"120.00"},{"v":6,"d":"6.00"}]
["Star Shines","24h",{"$f":"24*3600","v":{"v":86400,"d":"86,400"}},{"v":150000,"d":"150,000"},{"v":20000000,"d":"20,000,000"},{"v":1250000,"d":"1,250,000"},{"v":0.576,"d":"0.58"},{"v":133.33333333333334,"d":"133.33"},{"v":8.333333333333334,"d":"8.33"}]
[]
[]
["Feeding"]
[]
[null,"Food"]
["Level","Step","Level","Total"]
[1,5,{"$f":"B19*4","v":20},{"$f":"C19","v":20}]
[2,10,{"$f":"B20*4","v":40},{"$f":"D19+C20","v":60}]
[3,20,{"$f":"B21*4","v":80},{"$f":"D20+C21","v":140}]
[4,40,160,300]
[5,80,320,620]
[6,160,640,{"v":1260,"d":"1,260"}]
[7,320,{"v":1280,"d":"1,280"},{"v":2540,"d":"2,540"}]
[8,640,{"v":2560,"d":"2,560"},{"v":5100,"d":"5,100"}]
[9,{"v":1280,"d":"1,280"},{"v":5120,"d":"5,120"},{"v":10220,"d":"10,220"}]
[10,{"v":1664,"d":"1,664"},{"v":6656,"d":"6,656"},{"v":16876,"d":"16,876"}]
[11,{"v":2163,"d":"2,163"},{"v":8652,"d":"8,652"},{"v":25528,"d":"25,528"}]
[12,{"v":2812,"d":"2,812"},{"v":11248,"d":"11,248"},{"v":36776,"d":"36,776"}]
[13,{"v":3656,"d":"3,656"},{"v":14624,"d":"14,624"},{"v":51400,"d":"51,400"}]
[14,{"v":4753,"d":"4,753"},{"v":19012,"d":"19,012"},{"v":70412,"d":"70,412"}]
[15,{"v":6178,"d":"6,178"},{"v":24712,"d":"24,712"},{"v":95124,"d":"95,124"}]
[16,{"v":8032,"d":"8,032"},{"v":32128,"d":"32,128"},{"v":127252,"d":"127,252"}]
[17,{"v":10441,"d":"10,441"},{"v":41764,"d":"41,764"},{"v":169016,"d":"169,016"}]
[18,{"v":13574,"d":"13,574"},{"v":54296,"d":"54,296"},{"v":223312,"d":"223,312"}]
[19,{"v":17646,"d":"17,646"},{"v":70584,"d":"70,584"},{"v":293896,"d":"293,896"}]
[20,{"v":22940,"d":"22,940"},{"v":91760,"d":"91,760"},{"v":385656,"d":"385,656"}]
[21,{"v":29822,"d":"29,822"},{"v":119288,"d":"119,288"},{"v":504944,"d":"504,944"}]
[22,{"v":38768,"d":"38,768"},{"v":155072,"d":"155,072"},{"v":660016,"d":"660,016"}]
[23,{"v":50398,"d":"50,398"},{"v":201592,"d":"201,592"},{"v":861608,"d":"861,608"}]
[24,{"v":65518,"d":"65,518"},{"v":262072,"d":"262,072"},{"v":1123680,"d":"1,123,680"}]
[25,{"v":85173,"d":"85,173"},{"v":340692,"d":"340,692"},{"v":1464372,"d":"1,464,372"}]
[26,{"v":110725,"d":"110,725"},{"v":442900,"d":"442,900"},{"v":1907272,"d":"1,907,272"}]
[27,{"v":143943,"d":"143,943"},{"v":575772,"d":"575,772"},{"v":2483044,"d":"2,483,044"}]
[28,{"v":187126,"d":"187,126"},{"v":748504,"d":"748,504"},{"v":3231548,"d":"3,231,548"}]
[29,{"v":243264,"d":"243,264"},{"v":973056,"d":"973,056"},{"v":4204604,"d":"4,204,604"}]
[30,{"v":316243,"d":"316,243"},{"v":1264972,"d":"1,264,972"},{"v":5469576,"d":"5,469,576"}]
[31,{"v":347867,"d":"347,867"},{"v":1391468,"d":"1,391,468"},{"v":6861044,"d":"6,861,044"}]
[32,{"v":382654,"d":"382,654"},{"v":1530616,"d":"1,530,616"},{"v":8391660,"d":"8,391,660"}]
[33,{"v":420919,"d":"420,919"},{"v":1683676,"d":"1,683,676"},{"v":10075336,"d":"10,075,336"}]
[34,{"v":463011,"d":"463,011"},{"v":1852044,"d":"1,852,044"},{"v":11927380,"d":"11,927,380"}]
[35,{"v":509312,"d":"509,312"},{"v":2037248,"d":"2,037,248"},{"v":13964628,"d":"13,964,628"}]
[36,{"v":560243,"d":"560,243"},{"v":2240972,"d":"2,240,972"},{"v":16205600,"d":"16,205,600"}]
[37,{"v":616267,"d":"616,267"},{"v":2465068,"d":"2,465,068"},{"v":18670668,"d":"18,670,668"}]
[38,{"v":677894,"d":"677,894"},{"v":2711576,"d":"2,711,576"},{"v":21382244,"d":"21,382,244"}]
[39,{"v":745683,"d":"745,683"},{"v":2982732,"d":"2,982,732"},{"v":24364976,"d":"24,364,976"}]
[40]

{"sheet":"Single Element Breeding","index":5,"n_rows":16,"n_cols":25,"rows_kept":16,"merged":[[4,1,4,2],[4,3,4,4],[4,5,4,7],[4,8,4,9],[4,10,4,12],[4,13,4,14],[4,15,4,16],[4,17,4,18],[4,19,4,20],[4,21,4,23],[5,1,5,2],[6,1,6,2],[6,3,6,4],[7,5,7,7],[8,1,8,2],[8,5,8,7],[8,8,8,9],[9,1,9,2],[9,5,9,7],[9,10,9,12],[10,1,10,2],[10,6,10,7],[10,11,10,12],[10,13,10,14],[11,3,11,4],[11,10,11,12],[11,15,11,16],[12,6,12,7],[12,10,12,12],[12,17,12,18],[13,6,13,7],[13,10,13,12],[13,13,13,14],[13,19,13,20],[14,5,14,7],[14,15,14,16],[14,17,14,18],[14,19,14,20],[14,21,14,23],[15,1,15,2],[15,3,15,4],[15,5,15,7],[15,8,15,9],[15,13,15,14],[15,15,15,16],[15,17,15,18],[15,19,15,20]]}
["Breeding Completion Chart for Single Element Dragons (level 4 - 9)"]
[]
["Pure & Pure will give legendary dragons and have been ignored on this chart"]
[]
[null,"Dark",null,"Electric",null,"Flame",null,null,"Ice",null,"Archangel",null,null,"Metal",null,"Nature",null,"Sea",null,"Terra",null,"War",null,null,"Pure"]
["Dark","X"]
["Electric","Neon",null,"X"]
["Flame","Dark Fire","Vampire","Hot Metal","Laser","X"]
["Ice","Penguin",null,"Fluorescent","Moose","X",null,null,"X"]
["Archangel","X",null,"Photon","Archangel","Sun",null,null,"Cold Star","Archangel","X"]
["Metal","Zombie",null,"Gold","Battery","Steampunk","Medieval",null,"Pearl","Platinum","Rainbow","Archangel",null,"X"]
["Nature","Rattlesnake","Carnivore Plant","X",null,"Butterfly","Spicy","Firebird","Mojito","Dandelion","Gaia",null,null,"Dragonfly","Jade","X"]
["Sea","Pirate","Petroleum","Storm","Lantern Fish","Cloud","Blizzard",null,"Ice Cream","Icecube","Luminescent",null,null,"Seashell","Mercury","Coral","Nenufar","X"]
["Terra","Venom","Hedgehog","Chameleon","Sky","Volcano","Flaming Rock",null,"Alpine","Snowflake","Justice",null,null,"X",null,"Cactus","Tropical","Mud","Waterfall","X"]
["War","Dark Stone","War","Tesla","War","Juggernaut",null,null,"Nightwind","War","Elfic","War","Archangel","Panzer","War","Red Woods",null,"X",null,"Colossal",null,"X"]
["Pure","Pure Dark",null,"Pure Electric",null,"Pure Flame",null,null,"Pure Ice",null,"Zen","Pure","Archangel","Pure Metal",null,"Pure Nature",null,"Pure Sea",null,"Pure Terra",null,"Kratus","Pure","War","X"]

{"sheet":"Ancient World","index":6,"n_rows":41,"n_cols":35,"rows_kept":41,"merged":[[3,0,3,1],[3,2,3,3],[4,9,4,12],[4,15,4,16]]}
["Ancient World"]
[]
["Breeding"]
["Dragon 1",null,"Dragon 2",null,"Result",null,null,"Ancient Dragons",{"$nulls":6},"Breedable",{"$nulls":3},"Crafting","Summon :","Guardangel",{"$nulls":4},"Habitats",{"$nulls":4},"Gems",null,null,"Shapes"]
["Name","Level","Name","Level",null,"Habitat",null,"Dragon","Level","Elements",{"$nulls":4},"Dragon","Elements",null,null,"Gem","Shape","Required","Done","Clean","Done",null,"Name","Level","Upgrade","Time",null,1,"Red - Ruby",null,"Raw",0]
["Rebird",{"$f":"IF(ISBLANK(A6),\"\",VLOOKUP(A6,AncientDragonTable,2,0))","v":0},"Gorgoneia",{"$f":"IF(ISBLANK(C6),\"\",VLOOKUP(C6,AncientDragonTable,2,0))","v":0},"Mermaid","Magic",null,"Guardangel",null,"Ancient","Beauty","Terra",null,null,"Red Rose","Beauty","Chaos",null,"Red - Ruby","Raw",5,null,{"$f":"IF(ISBLANK(S6),\"\",U6*POWER(5,VLOOKUP(T6,ShapeTable,2,0)-1))","v":1},null,null,"Beauty",1,"560/1300","2h/4h",null,2,"Blue - Sapphire",null,"Clean",1]
["Guardangel",0,"Fulltune",0,"Bride","Beauty",null,"Gorgoneia",null,"Ancient","Magic","Sea",null,null,"Flawless","Beauty","Dream",{"$nulls":5},"",null,null,"Magic",1,"950/2600","2h/4h",null,3,"Yellow - Topaz",null,"5S - Pure",2]
["Guardangel",0,"Obserno",0,"Red Rose","Beauty",null,"Piercing",null,"Ancient","Chaos","Nature",null,null,"Bride","Beauty","Happy",{"$nulls":5},"",null,null,"Chaos",1,"1500/3900","3h/5h",null,4,"Green - Emerald",null,"Drop - Fine",3]
["Piercing",0,"Swin-Jin",0,"Secret Fire","Magic",null,"Rebird",null,"Ancient","Beauty","Flame",null,null,"Mermaid","Beauty","Magic",{"$nulls":5},"",null,null,"Happy",1,"6200/8000","3h/5h",null,5,"Black - Onyx",null,"Tri - Neat",4]
["Guardangel",0,"Ignox",0,"Flawless","Dream",null,"Swin-Jin",null,"Ancient","Magic","Electric",null,null,"Amber","Beauty","Soul",{"$nulls":5},"",null,null,"Dream",1,"8500/10800","4h/6h",null,6,"White - Diamond",null,"Squ - Bright",5]
["Fulltune",0,"Ignox",0,"Balloon","Dream",null,"Obserno",null,"Ancient","Chaos","Metal",null,null,"Prophet","Chaos","Dream",{"$nulls":5},"",null,null,"Soul",1,"11000/14000","4h/6h",{"$nulls":4},"Dbl S - Squared",6]
["Gorgoneia",{"$f":"IF(ISBLANK(A12),\"\",VLOOKUP(A12,AncientDragonTable,2,0))","v":0},"Surfaster",{"$f":"IF(ISBLANK(C12),\"\",VLOOKUP(C12,AncientDragonTable,2,0))","v":0},"Gurgle","Happy",null,"Edeluxe",null,"Ancient","Beauty","Ice",null,null,"Naughty","Chaos","Happy",{"$nulls":16},"6S - Carved",7]
["Piercing",{"$f":"IF(ISBLANK(A13),\"\",VLOOKUP(A13,AncientDragonTable,2,0))","v":0},"Surfaster",{"$f":"IF(ISBLANK(C13),\"\",VLOOKUP(C13,AncientDragonTable,2,0))","v":0},"Naughty","Beauty",null,"Poseadus",null,"Ancient","Magic","Light",null,null,"Underworld","Chaos","Soul",null,"Crafting","Evolve :","Guardangel",{"$nulls":12},"Oval",8]
["Edeluxe",{"$f":"IF(ISBLANK(A14),\"\",VLOOKUP(A14,AncientDragonTable,2,0))","v":0},"Turkgon",{"$f":"IF(ISBLANK(C14),\"\",VLOOKUP(C14,AncientDragonTable,2,0))","v":0},"Amber","Happy",null,"Squidus",null,"Ancient","Chaos","Dark",null,null,"Dreamcatcher","Dream","Soul",null,"Gem","Shape","Required","Done","Clean","Done",{"$nulls":9},"R Tri - Perfect",9]
["Piercing",{"$f":"IF(ISBLANK(A15),\"\",VLOOKUP(A15,AncientDragonTable,2,0))","v":0},"Deliriam",{"$f":"IF(ISBLANK(C15),\"\",VLOOKUP(C15,AncientDragonTable,2,0))","v":0},"Prophet","Chaos",null,"Fulltune",null,"Ancient","Happy","Terra",null,null,"Balloon","Happy","Dream",null,"Red - Ruby","Raw",1,null,{"v":0.2,"d":"0"}]
["Poseadus",{"$f":"IF(ISBLANK(A16),\"\",VLOOKUP(A16,AncientDragonTable,2,0))","v":0},"Cosmoprime",{"$f":"IF(ISBLANK(C16),\"\",VLOOKUP(C16,AncientDragonTable,2,0))","v":0},"Chakra","Soul",null,"Glowppy",null,"Ancient","Happy","Flame",null,null,"The Amazing","Happy","Soul",null,"Red - Ruby","Clean",1,null,1]
["Ankeror",0,"Obserno",0,"Underworld","Chaos",null,"Surfaster",null,"Ancient","Happy","Sea",null,null,"Secret Fire","Magic","Chaos",{"$nulls":5},""]
["Deliriam",0,"Swin-Jin",0,"Illusion","Dream",null,"Deliriam",null,"Ancient","Dream","Nature",null,null,"Illusion","Magic","Dream",{"$nulls":5},""]
["Ankeror",0,"Surfaster",0,"The Amazing","Soul",null,"Ignox",null,"Ancient","Dream","Terra",null,null,"Gurgle","Magic","Happy",{"$nulls":5},""]
["Ankeror",0,"Recondite",0,"Dreamcatcher","Dream",null,"Recondite",null,"Ancient","Dream","Dark",null,null,"Chakra","Magic","Soul",{"$nulls":5},""]
[null,{"$f":"IF(ISBLANK(A21),\"\",VLOOKUP(A21,AncientDragonTable,2,0))","v":""},null,{"$f":"IF(ISBLANK(C21),\"\",VLOOKUP(C21,AncientDragonTable,2,0))","v":""},{"$nulls":3},"Ankeror",null,"Ancient","Soul","Metal",{"$nulls":10},""]
[null,"",null,"",{"$nulls":3},"Cosmoprime",null,"Ancient","Soul","Light",{"$nulls":10},""]
[null,"",null,"",{"$nulls":3},"Turkgon",null,"Ancient","Soul","Ice",{"$nulls":10},""]
[null,"",null,""]
[null,"",null,""]
[null,"",null,""]
[null,"",null,""]
[null,"",null,""]
[null,"",null,""]
[null,"",null,""]
[null,"",null,""]
[null,"",null,""]
[null,"",null,""]
[null,"",null,""]
[null,"",null,""]
[null,"",null,""]
[null,"",null,""]
[null,"",null,""]
[null,"",null,""]
[null,"",null,""]
[{"$nulls":3},""]

{"sheet":"Timers","index":7,"n_rows":52,"n_cols":4,"rows_kept":52,"merged":[[13,2,13,3]]}
["Timers"]
[]
["Now","2015-11-21T19:55:49"]
["Wait Days",0]
["Wait Hours",0]
["Wait Minutes",40]
["Wait Seconds",0]
["Wait Time",{"$f":"TIME(B5,B6,B7)","v":"00:40:00"}]
["Expiry Time",{"$f":"B3+B4+B8","v":"2015-11-21T20:35:49"}]
[]
[]
[]
[]
["Time","Description","Remaining"]
[null,"AW - Summon",{"$f":"IF(D15=\"\",\"\",IF(INT(D15)>0,INT(D15),\"\"))","v":""},{"$f":"IF(ISBLANK(A15),\"\",A15-CurTime)","v":""}]
[null,"Breeding - Ancient World",{"$f":"IF(D16=\"\",\"\",IF(INT(D16)>0,INT(D16),\"\"))","v":""},""]
[null,"Breeding - Mountain","",""]
[null,"Breeding - Sanctury","",""]
[null,"Breeding - Tree","",""]
[null,"Calendar","",""]
[null,"Combat League","",""]
[null,"Deus Daily Shuffle","",""]
[null,"Dragon Card Pack","",""]
[null,"Dragon Market","",""]
[null,"Farms","",""]
[null,"Habitat Ready","",""]
[null,"Hatchery - ","",""]
[null,"Hatchery - ","",""]
[null,"Hatchery - ","",""]
[null,"Quest - Battle","",""]
[null,"Quest - Collect 8h 600","",""]
[null,"Quest Ends","",""]
[null,"Stadium Tournament","",""]
[null,"Tower - Broodby's","",""]
[null,"Tower - Damona's","",""]
[null,"Tower - Hanzo's","",""]
[null,"Tower - Jewelem's","",""]
[null,"Tower - Midarian's","",""]
[null,"Tower - Phaun's","",""]
[null,"Tower - Ramsey's","",""]
[null,"Tower - Speedy and Greedy's",{"$f":"IF(D41=\"\",\"\",IF(INT(D41)>0,INT(D41),\"\"))","v":""},{"$f":"IF(ISBLANK(A41),\"\",A41-CurTime)","v":""}]
[null,"Tower - Winstance's","",""]
[null,"Training Centre","",""]
[null,null,"",""]
[null,null,"",""]
[null,null,"",""]
[null,null,"",""]
[null,null,"",""]
[null,null,"",""]
[null,null,"",""]
[null,null,"",""]
[null,null,"",""]