{"text_format":"3","workbook":"xlsx","n_sheets":8,"sheets":["Instructions","My Dragons","Habitats","Tables","Info","Single Element Breeding","Ancient World","Timers"],"not_rendered":{"images":1,"macros":1,"defined_names":21},"read":"whole","date_system":"1900"}

{"sheet":"Instructions","index":0,"n_rows":64,"n_cols":1,"rows_kept":64}
["Dragon City Helper Spreadsheet"]
[]
["This spreadsheet has been written to assist you in managing your Dragon City. All the cells that shouldn't be edited have been locked and protected. You can unprotect them and edit them if you know what you are doing. Actually, you can unprotect and edit them even if you don't know what you're doing :-D"]
[]
["The main areas you will use are the \"My Dragons\", \"Habitats\" and \"Timers\" tabs. I've provided instructions below so as not to clutter the relevant worksheets. You can drag the tabs into whichever order you prefer. I like to have the \"Timers\" tab at the end for easy access."]
[]
["My Dragons"]
["Enter your dragon information in columns B thru J as follows:"]
["Column B : Enter the dragon as defined in Dragon City. If you are breeding a dragon that could be any of a number of dragons, use \"Unknown\" or any other name that tells you that you can only determine it once in the hatchery."]
["Column C : Enter the name you have given to that dragon. I named mine the same as in B, adding a 2, 3 etc for duplicates. When I have a dragon in storage, I put the hatching time in this cell eg. \"17h\" if it will take 17 hours to hatch. The breeding/hatching time can be obtained from the \"Tables\" tab."]
["Column D : Enter the level of your dragon. I use 0 for dragons in the hatchery, -1 for dragons in the breeding mountain, -2 for dragons in the breeding tree, -3 for dragons in the breeding sanctuary, and -9 for dragon eggs in storage. You can use whatever works for you."]
["Column E : Enter the star ranking of your dragon (G3, S2, B1 etc)."]
["Column F : Select the type of habitat where you have placed your dragon from the dropdown."]
["Columns G - J : When you train your dragon, enter the number of the attack you are replacing in the T-column eg to replace Attack 1 with Trainable Attack 4, enter 1 in the T4 column."]
[]
["When you enter a valid dragon in Column B, Columns K - AM are populated with information from the \"Tables\" tab. This tells you what category, elements and attacks the dragon has."]
["Attacks with white backgrounds are useable, yellow indicates the attack is unavailable until the required level is attained and green indicates trainable attacks."]
[]
["If the background of column B turnes orange, this indicates a duplicate dragon exists in the spreadsheet."]
[]
{"$rows_left_out":45}
{"sheet":"My Dragons","index":1,"n_rows":710,"n_cols":39,"rows_kept":710,"merged":[[1,29,1,30],[2,15,2,38],[3,11,3,14],[3,15,3,26],[3,27,3,38],[4,15,4,17],[4,18,4,20],[4,21,4,23],[4,24,4,26],[4,27,4,29],[4,30,4,32],[4,33,4,35],[4,36,4,38]]}
["Dragon City - My Dragons",{"$nulls":26},"Legend"]
[{"$nulls":27},"Useable","Trainable","Unavailable"]
[{"$nulls":15},"Combat"]
[{"$nulls":11},"Elements",{"$nulls":3},"Attack",{"$nulls":11},"Trainable"]
["Number","Dragon","Name","Level","Rank","Habitat","T1","T2","T3","T4","Category",1,2,3,4,1,null,null,2,null,null,3,null,null,4,null,null,1,null,null,2,null,null,3,null,null,4]
[1,"Flame","Xili",4,null,"Flame",{"$nulls":4},{"$f":"IF(ISBLANK($B6),0,VLOOKUP($B6,FullDragonTable,2,0))","v":1},{"$f":"IF(ISBLANK($B6),\"\",IF(ISBLANK(VLOOKUP($B6,FullDragonTable,3,0)),\"\",VLOOKUP($B6,FullDragonTable,3,0)))","v":"Flame"},{"$f":"IF(ISBLANK($B6),\"\",IF(ISBLANK(VLOOKUP($B6,FullDragonTable,4,0)),\"\",VLOOKUP($B6,FullDragonTable,4,0)))","v":" "},{"$f":"IF(ISBLANK($B6),\"\",IF(ISBLANK(VLOOKUP($B6,FullDragonTable,5,0)),\"\",VLOOKUP($B6,FullDragonTable,5,0)))","v":""},{"$f":"IF(ISBLANK($B6),\"\",IF(ISBLANK(VLOOKUP($B6,FullDragonTable,6,0)),\"\",VLOOKUP($B6,FullDragonTable,6,0)))","v":""},{"$f":"IF(ISBLANK($B6),\"\",VLOOKUP($B6,FullDragonTable,7,0))","v":"Punch"},{"$f":"IF(ISBLANK($B6),\"\",VLOOKUP(P6,AttackTable,2,0))","v":"Physical"},{"$f":"IF(ISBLANK($B6),\"\",VLOOKUP(P6,AttackTable,3,0))","v":338},{"$f":"IF(ISBLANK($B6),\"\",VLOOKUP($B6,FullDragonTable,8,0))","v":"Lava Balls"},{"$f":"IF(ISBLANK($B6),\"\",VLOOKUP(S6,AttackTable,2,0))","v":"Flame"},{"$f":"IF(ISBLANK($B6),\"\",VLOOKUP(S6,AttackTable,3,0))","v":550},{"$f":"IF(ISBLANK($B6),\"\",VLOOKUP($B6,FullDragonTable,9,0))","v":"Flaming Arrows"},{"$f":"IF(ISBLANK($B6),\"\",VLOOKUP(V6,AttackTable,2,0))","v":"Flame"},{"$f":"IF(ISBLANK($B6),\"\",VLOOKUP(V6,AttackTable,3,0))","v":650},{"$f":"IF(ISBLANK($B6),\"\",VLOOKUP($B6,FullDragonTable,10,0))","v":"Nuclear Hit"},{"$f":"IF(ISBLANK($B6),\"\",VLOOKUP(Y6,AttackTable,2,0))","v":"Flame"},{"$f":"IF(ISBLANK($B6),\"\",VLOOKUP(Y6,AttackTable,3,0))","v":1050},{"$f":"IF(ISBLANK($B6),\"\",VLOOKUP($B6,FullDragonTable,11,0))","v":"Hard Charge"},{"$f":"IF(ISBLANK($B6),\"\",VLOOKUP(AB6,AttackTable,2,0))","v":"Physical"},{"$f":"IF(ISBLANK($B6),\"\",VLOOKUP(AB6,AttackTable,3,0))","v":488},{"$f":"IF(ISBLANK($B6),\"\",VLOOKUP($B6,FullDragonTable,12,0))","v":"Head Butt"},{"$f":"IF(ISBLANK($B6),\"\",VLOOKUP(AE6,AttackTable,2,0))","v":"Physical"},{"$f":"IF(ISBLANK($B6),\"\",VLOOKUP(AE6,AttackTable,3,0))","v":788},{"$f":"IF(ISBLANK($B6),\"\",VLOOKUP($B6,FullDragonTable,13,0))","v":"Flamethrower"},{"$f":"IF(ISBLANK($B6),\"\",VLOOKUP(AH6,AttackTable,2,0))","v":"Flame"},{"$f":"IF(ISBLANK($B6),\"\",VLOOKUP(AH6,AttackTable,3,0))","v":1200},{"$f":"IF(ISBLANK($B6),\"\",VLOOKUP($B6,FullDragonTable,14,0))","v":"Magma Storm"},{"$f":"IF(ISBLANK($B6),\"\",VLOOKUP(AK6,AttackTable,2,0))","v":"Flame"},{"$f":"IF(ISBLANK($B6),\"\",VLOOKUP(AK6,AttackTable,3,0))","v":1350}]
[2,"Terra","Bobo",4,null,"Terra",{"$nulls":4},{"$f":"IF(ISBLANK($B7),0,VLOOKUP($B7,FullDragonTable,2,0))","v":1},"Terra"," ","","","Punch","Physical",338,"Earthquake","Terra",550,"Meteor Shower","Terra",650,"Tumble Weed","Nature",1050,"Hard Charge","Physical",488,"Tumble Weed","Nature",1050,"Judo Kick","Physical",863,"Sand Storm","Terra",1350]
[3,{"$nulls":9},{"$f":"IF(ISBLANK($B8),0,VLOOKUP($B8,FullDragonTable,2,0))","v":0},"","","","","","","","","","","","","","","","","","","","","","","","","","","",""]
[4,{"$nulls":9},{"$f":"IF(ISBLANK($B9),0,VLOOKUP($B9,FullDragonTable,2,0))","v":0},"","","","","","","","","","","","","","","","","","","","","","","","","","","",""]
[5,{"$nulls":9},{"$f":"IF(ISBLANK($B10),0,VLOOKUP($B10,FullDragonTable,2,0))","v":0},"","","","","","","","","","","","","","","","","","","","","","","","","","","",""]
[6,{"$nulls":9},{"$f":"IF(ISBLANK($B11),0,VLOOKUP($B11,FullDragonTable,2,0))","v":0},"","","","","","","","","","","","","","","","","","","","","","","","","","","",""]
[7,{"$nulls":9},{"$f":"IF(ISBLANK($B12),0,VLOOKUP($B12,FullDragonTable,2,0))","v":0},"","","","","","","","","","","","","","","","","","","","","","","","","","","",""]
[8,{"$nulls":9},{"$f":"IF(ISBLANK($B13),0,VLOOKUP($B13,FullDragonTable,2,0))","v":0},"","","","","","","","","","","","","","","","","","","","","","","","","","","",""]
[9,{"$nulls":9},{"$f":"IF(ISBLANK($B14),0,VLOOKUP($B14,FullDragonTable,2,0))","v":0},"","","","","","","","","","","","","","","","","","","","","","","","","","","",""]
[10,{"$nulls":9},{"$f":"IF(ISBLANK($B15),0,VLOOKUP($B15,FullDragonTable,2,0))","v":0},"","","","","","","","","","","","","","","","","","","","","","","","","","","",""]
[11,{"$nulls":9},{"$f":"IF(ISBLANK($B16),0,VLOOKUP($B16,FullDragonTable,2,0))","v":0},"","","","","","","","","","","","","","","","","","","","","","","","","","","",""]
[12,{"$nulls":9},{"$f":"IF(ISBLANK($B17),0,VLOOKUP($B17,FullDragonTable,2,0))","v":0},"","","","","","","","","","","","","","","","","","","","","","","","","","","",""]
[13,{"$nulls":9},{"$f":"IF(ISBLANK($B18),0,VLOOKUP($B18,FullDragonTable,2,0))","v":0},"","","","","","","","","","","","","","","","","","","","","","","","","","","",""]
[14,{"$nulls":9},{"$f":"IF(ISBLANK($B19),0,VLOOKUP($B19,FullDragonTable,2,0))","v":0},"","","","","","","","","","","","","","","","","","","","","","","","","","","",""]
[15,{"$nulls":9},{"$f":"IF(ISBLANK($B20),0,VLOOKUP($B20,FullDragonTable,2,0))","v":0},"","","","","","","","","","","","","","","","","","","","","","","","","","","",""]
{"$rows_left_out":691}
{"sheet":"Habitats","index":2,"n_rows":38,"n_cols":10,"rows_kept":38,"merged":[[2,5,2,6],[2,8,2,9],[4,8,5,8],[4,9,5,9],[6,8,7,8],[6,9,7,9],[8,8,9,8],[8,9,9,9],[10,8,11,8],[10,9,11,9],[12,8,13,8],[12,9,13,9],[14,8,15,8],[14,9,15,9],[16,8,17,8],[16,9,17,9],[18,8,19,8],[18,9,19,9],[20,8,21,8],[20,9,21,9],[22,8,23,8],[22,9,23,9]]}
["Habitats"]
[]
[{"$nulls":5},"Dragons",null,null,"% Used"]
["Habitat","Capacity","Build","Island","Storage","Total","Island","Used","Total","Island"]
["Terra",2,"10s",1,0,{"$f":"(D5+E5)*B5","v":2},{"$f":"D5*B5","v":2},{"$f":"COUNTIF('My Dragons'!$F$6:$F$710,A5)","v":1},{"$f":"IF((F5+F6)=0,0,(H5+H6)/(F5+F6))","v":{"v":0.5,"d":"50%"}},{"$f":"IF((H5+H6)=0,0,(H5+H6)/(G5+G6))","v":{"v":0.5,"d":"50%"}}]
["Big Terra",4,"30s",0,0,{"$f":"(D6+E6)*B6","v":0},{"$f":"D6*B6","v":0},{"$f":"COUNTIF('My Dragons'!$F$6:$F$710,A6)","v":0}]
["Flame",2,"10s",1,0,{"$f":"(D7+E7)*B7","v":2},2,{"$f":"COUNTIF('My Dragons'!$F$6:$F$710,A7)","v":1},{"$f":"IF((F7+F8)=0,0,(H7+H8)/(F7+F8))","v":{"v":0.5,"d":"50%"}},{"$f":"IF((H7+H8)=0,0,(H7+H8)/(G7+G8))","v":{"v":0.5,"d":"50%"}}]
["Big Flame",4,"2h",0,0,0,0,{"$f":"COUNTIF('My Dragons'!$F$6:$F$710,A8)","v":0}]
["Sea",1,"10s",0,0,0,0,{"$f":"COUNTIF('My Dragons'!$F$6:$F$710,A9)","v":0},{"$f":"IF((F9+F10)=0,0,(H9+H10)/(F9+F10))","v":{"v":0,"d":"0%"}},{"$f":"IF((H9+H10)=0,0,(H9+H10)/(G9+G10))","v":{"v":0,"d":"0%"}}]
["Big Sea",3,"2h",0,0,0,0,{"$f":"COUNTIF('My Dragons'!$F$6:$F$710,A10)","v":0}]
["Nature",2,"1h",0,0,0,0,{"$f":"COUNTIF('My Dragons'!$F$6:$F$710,A11)","v":0},{"$f":"IF((F11+F12)=0,0,(H11+H12)/(F11+F12))","v":{"v":0,"d":"0%"}},{"$f":"IF((H11+H12)=0,0,(H11+H12)/(G11+G12))","v":{"v":0,"d":"0%"}}]
["Big Nature",4,"2h",0,0,0,0,{"$f":"COUNTIF('My Dragons'!$F$6:$F$710,A12)","v":0}]
["Electric",2,"2h",0,0,0,0,{"$f":"COUNTIF('My Dragons'!$F$6:$F$710,A13)","v":0},{"$f":"IF((F13+F14)=0,0,(H13+H14)/(F13+F14))","v":{"v":0,"d":"0%"}},{"$f":"IF((H13+H14)=0,0,(H13+H14)/(G13+G14))","v":{"v":0,"d":"0%"}}]
["Big Electric",4,"8h",0,0,0,0,{"$f":"COUNTIF('My Dragons'!$F$6:$F$710,A14)","v":0}]
["Ice",1,"-",0,0,0,0,{"$f":"COUNTIF('My Dragons'!$F$6:$F$710,A15)","v":0},{"$f":"IF((F15+F16)=0,0,(H15+H16)/(F15+F16))","v":{"v":0,"d":"0%"}},{"$f":"IF((H15+H16)=0,0,(H15+H16)/(G15+G16))","v":{"v":0,"d":"0%"}}]
["Big Ice",3,"12h",0,0,0,0,{"$f":"COUNTIF('My Dragons'!$F$6:$F$710,A16)","v":0}]
["Metal",2,"-",0,0,0,0,{"$f":"COUNTIF('My Dragons'!$F$6:$F$710,A17)","v":0},{"$f":"IF((F17+F18)=0,0,(H17+H18)/(F17+F18))","v":{"v":0,"d":"0%"}},{"$f":"IF((H17+H18)=0,0,(H17+H18)/(G17+G18))","v":{"v":0,"d":"0%"}}]
["Big Metal",4,"18h",0,0,0,0,{"$f":"COUNTIF('My Dragons'!$F$6:$F$710,A18)","v":0}]
["Dark",2,"2h",0,0,0,0,{"$f":"COUNTIF('My Dragons'!$F$6:$F$710,A19)","v":0},{"$f":"IF((F19+F20)=0,0,(H19+H20)/(F19+F20))","v":{"v":0,"d":"0%"}},{"$f":"IF((H19+H20)=0,0,(H19+H20)/(G19+G20))","v":{"v":0,"d":"0%"}}]
["Big Dark",4,"30h",0,0,0,0,{"$f":"COUNTIF('My Dragons'!$F$6:$F$710,A20)","v":0}]
{"$rows_left_out":19}
{"sheet":"Tables","index":3,"n_rows":730,"n_cols":25,"rows_kept":730,"merged":[[1,11,1,14],[1,15,1,22]]}
[]
[{"$nulls":11},"Habitat",{"$nulls":3},"Attack"]
["Attack","Element","Damage",null,"Elements",null,"Attack Element",null,"Number","Dragon","Category",1,2,3,4,1,2,3,4,"T1","T2","T3","T4","Breedable","Breed/Hatch"]
["Acid Rain","Sea",1200,null,"Beauty",null,"Beauty",null,1,"Abyss",5,"Light","Dark","Ice","Flame","Light Sword","Ghost Cloud","Frost Nova","Nuclear Hit","Enlightning Wisdom","The Grim Reaper","Icy Wind","Magma Storm",1,"62/72"]
["Appeal","Happy",1350,null,"Chaos",null,"Chaos",null,2,"Ace",4,"Sea","Nature","Metal",null,"Judo Kick","Flooding","Stitching Roots","Nail Rain","Hammer Fist","Acid Rain","Rottening Spell","Cannon Balls",0,23]
["Asteroid","Terra",1200,null,"Dark",null,"Dark",null,3,"Acoustic",4,"Dark","Electric",null,null,"Punch","Life Drain","Electric Shock","Leech","The Grim Reaper","Electro Ball","Black Hole","Tesla Ray",1,"58/68"]
["Astro Hit","War",1650,null,"Dream",null,"Dream",null,4,"Adamantium",4,"Metal","Terra",null,null,"Stunning Hit","Nail Rain","Magneto","Tumble Weed","Hammer Fist","Cannon Balls","Ninja Stars","Sand Storm",0,16]
["Aurora Borealis","Legend",2100,null,"Electric",null,"Electric",null,5,"Adventure",4,"Terra","Flame","Light",null,"Stunning Hit","Tumble Weed","Flaming Arrows","Light Prism","Karate Brick Break","Sand Storm","Magma Storm","Light Star",0,23]
["Bee Hive","Nature",1350,null,"Flame",null,"Flame",null,6,"Albino",4,"Sea","Nature","Light",null,"Hard Charge","Flooding","Poison Ivy","Light Prism","Hammer Fist","Acid Rain","Rottening Spell","Enlightning Wisdom",0,23]
["Black Hole","Dark",1350,null,"Happy",null,"Happy",null,7,"Alien",4,"Sea","Metal",null,null,"Stunning Hit","Storm","Judo Kick","Rust","Acid Rain","Hammer Fist","Ninja Stars","Karate Brick Break",0,15]
["Bright Aura","Beauty",1175,null,"Ice",null,"Ice",null,8,"Allure",5,"Light ","Nature",null,null,"Head Butt","Light Sword","Light Prism","Poison Ivy","Deus Sword","Enlightning Wisdom","Out of Time","Bee Hive",0,23]
["Brilliant Firework","Happy",1050,null,"Legend",null,"Legend",null,9,"Alpine",2,"Terra","Ice",null,null,"Flying Kick","Ice Spikes","Stunning Hit","Tumble Weed","Head Butt","Asteroid","Icy Wind","Sand Storm",1,"13/19"]
["Cannon Balls","Metal",1200,null,"Light",null,"Light",null,10,"Amazone",4,"Metal","Dark","Nature",null,"Hard Charge","Cannon Balls","Ghost Cloud","Stitching Roots","Stunning Hit","Ninja Stars","The Grim Reaper","Leaf Blast",0,23]
["Celestial Hand","Soul",1050,null,"Magic",null,"Magic",null,11,"Amber",4,"Beauty","Soul",null,null,"Judo Kick","Floral Coup","Soul Breaker","Bright Aura","Karate Brick Break","Deus Sword","Grace Touch","Supernatural",1,"16/24"]
["Confusing Wake","Dream",1050,null,"Metal",null,"Metal",null,12,"Amerindian",6,"Nature","Terra","Pure",null,"Punch","Stitching Roots","Earthquake","Pure Energy","Hammer Fist","Poison Ivy","Meteor Shower","Pure Light",0,"23"]
["Cryogenic Freeze","Ice",1350,null,"Nature",null,"Nature",null,13,"Amethyst",4,"Nature","Metal",null,null,"Flying Kick","Stitching Roots","Head Butt","Rust","Hammer Fist","Bee Hive","Karate Brick Break","Cannon Balls",0,17]
["Destiny Chains","Chaos",1175,null,"Pure",null,"Physical",null,14,"Ancient",4,"Terra","Ice","Nature",null,"Punch","Lightning","Snow Storm","Leaf Blast","Deus Sword","Electro Ball","Cryogenic Freeze","Rottening Spell",0,17]
["Deus Sword","Physical",1125,null,"Sea",null,"Pure",null,15,"Angry",4,"Terra","Flame","Nature",null,"Stunning Hit","Earthquake","Leaf Blast","Nuclear Hit","Hammer Fist","Asteroid","Flamethrower","Rottening Spell",1,"16/24"]
["Disorder","Chaos",1350,null,"Soul",null,"Sea",null,16,"Animation",4,"Sea","Electric",null,null,"Punch","Tsunami","Judo Kick","Lightning","Acid Rain","Electro Ball","Whirlpool","Tesla Ray",0,17]
["Earthquake","Terra",550,null,"Terra",null,"Soul",null,17,"Anniversary",4,"Sea","Nature","Flame",null,"Punch","Flooding","Leaf Blast","Lava Balls","Hammer Fist","Whirlpool","Rottening Spell","Flamethrower",0,23]
{"$rows_left_out":711}
{"sheet":"Info","index":4,"n_rows":58,"n_cols":9,"rows_kept":58,"merged":[[1,5,1,7],[2,1,2,2],[16,1,16,2]]}
["Cost of Food"]
[{"$nulls":5},"Cost"]
["Food","Time",null,"Collect","Price","XP","Secs / unit","Gold / unit","XP / unit"]
["Dragon Belle","30s",30,5,50,25,{"$f":"C4/D4","v":{"v":6,"d":"6.00"}},{"$f":"E4/D4","v":{"v":10,"d":"10.00"}},{"$f":"F4/D4","v":{"v":5,"d":"5.00"}}]
["Hot Dragon Chili","5m",{"$f":"5*60","v":300},25,250,250,{"$f":"C5/D5","v":{"v":12,"d":"12.00"}},{"$f":"E5/D5","v":{"v":10,"d":"10.00"}},{"$f":"F5/D5","v":{"v":10,"d":"10.00"}}]
["Caterpillar Lily","30m",{"$f":"30*60","v":{"v":1800,"d":"1,800"}},75,{"v":1000,"d":"1,000"},{"v":1000,"d":"1,000"},{"v":24,"d":"24.00"},{"v":13.333333333333334,"d":"13.33"},{"v":13.333333333333334,"d":"13.33"}]
["Unicorn Horns","2h",{"$f":"2*3600","v":{"v":7200,"d":"7,200"}},200,{"v":5000,"d":"5,000"},{"v":5000,"d":"5,000"},{"v":36,"d":"36.00"},{"v":25,"d":"25.00"},{"v":25,"d":"25.00"}]
["Ladybird Blossom","6h",{"$f":"6*3600","v":{"v":21600,"d":"21,600"}},500,{"v":15000,"d":"15,000"},{"v":15000,"d":"15,000"},{"v":43.2,"d":"43.20"},{"v":30,"d":"30.00"},{"v":30,"d":"30.00"}]
["Rainbow Flower","3h",{"$f":"3*3600","v":{"v":10800,"d":"10,800"}},{"v":2250,"d":"2,250"},{"v":150000,"d":"150,000"},{"v":18750,"d":"18,750"},{"v":4.8,"d":"4.80"},{"v":66.66666666666667,"d":"66.67"},{"v":8.333333333333334,"d":"8.33"}]
["Spike Balls","9h",{"$f":"9*3600","v":{"v":32400,"d":"32,400"}},{"v":10000,"d":"10,000"},{"v":1000000,"d":"1,000,000"},{"v":100000,"d":"100,000"},3.24,{"v":100,"d":"100.00"},{"v":10,"d":"10.00"}]
["Flesh Eaters","12h",{"$f":"12*3600","v":{"v":43200,"d":"43,200"}},{"v":25000,"d":"25,000"},{"v":3000000,"d":"3,000,000"},{"v":150000,"d":"150,000"},{"v":1.728,"d":"1.73"},{"v":120,"d":"120.00"},{"v":6,"d":"6.00"}]
["Star Shines","24h",{"$f":"24*3600","v":{"v":86400,"d":"86,400"}},{"v":150000,"d":"150,000"},{"v":20000000,"d":"20,000,000"},{"v":1250000,"d":"1,250,000"},{"v":0.576,"d":"0.58"},{"v":133.33333333333334,"d":"133.33"},{"v":8.333333333333334,"d":"8.33"}]
[]
[]
["Feeding"]
[]
[null,"Food"]
["Level","Step","Level","Total"]
[1,5,{"$f":"B19*4","v":20},{"$f":"C19","v":20}]
[2,10,{"$f":"B20*4","v":40},{"$f":"D19+C20","v":60}]
{"$rows_left_out":39}
{"sheet":"Single Element Breeding","index":5,"n_rows":16,"n_cols":25,"rows_kept":16,"merged":[[4,1,4,2],[4,3,4,4],[4,5,4,7],[4,8,4,9],[4,10,4,12],[4,13,4,14],[4,15,4,16],[4,17,4,18],[4,19,4,20],[4,21,4,23],[5,1,5,2],[6,1,6,2],[6,3,6,4],[7,5,7,7],[8,1,8,2],[8,5,8,7],[8,8,8,9],[9,1,9,2],[9,5,9,7],[9,10,9,12],[10,1,10,2],[10,6,10,7],[10,11,10,12],[10,13,10,14],[11,3,11,4],[11,10,11,12],[11,15,11,16],[12,6,12,7],[12,10,12,12],[12,17,12,18],[13,6,13,7],[13,10,13,12],[13,13,13,14],[13,19,13,20],[14,5,14,7],[14,15,14,16],[14,17,14,18],[14,19,14,20],[14,21,14,23],[15,1,15,2],[15,3,15,4],[15,5,15,7],[15,8,15,9],[15,13,15,14],[15,15,15,16],[15,17,15,18],[15,19,15,20]]}
["Breeding Completion Chart for Single Element Dragons (level 4 - 9)"]
[]
["Pure & Pure will give legendary dragons and have been ignored on this chart"]
[]
[null,"Dark",null,"Electric",null,"Flame",null,null,"Ice",null,"Archangel",null,null,"Metal",null,"Nature",null,"Sea",null,"Terra",null,"War",null,null,"Pure"]
["Dark","X"]
["Electric","Neon",null,"X"]
["Flame","Dark Fire","Vampire","Hot Metal","Laser","X"]
["Ice","Penguin",null,"Fluorescent","Moose","X",null,null,"X"]
["Archangel","X",null,"Photon","Archangel","Sun",null,null,"Cold Star","Archangel","X"]
["Metal","Zombie",null,"Gold","Battery","Steampunk","Medieval",null,"Pearl","Platinum","Rainbow","Archangel",null,"X"]
["Nature","Rattlesnake","Carnivore Plant","X",null,"Butterfly","Spicy","Firebird","Mojito","Dandelion","Gaia",null,null,"Dragonfly","Jade","X"]
["Sea","Pirate","Petroleum","Storm","Lantern Fish","Cloud","Blizzard",null,"Ice Cream","Icecube","Luminescent",null,null,"Seashell","Mercury","Coral","Nenufar","X"]
["Terra","Venom","Hedgehog","Chameleon","Sky","Volcano","Flaming Rock",null,"Alpine","Snowflake","Justice",null,null,"X",null,"Cactus","Tropical","Mud","Waterfall","X"]
["War","Dark Stone","War","Tesla","War","Juggernaut",null,null,"Nightwind","War","Elfic","War","Archangel","Panzer","War","Red Woods",null,"X",null,"Colossal",null,"X"]
["Pure","Pure Dark",null,"Pure Electric",null,"Pure Flame",null,null,"Pure Ice",null,"Zen","Pure","Archangel","Pure Metal",null,"Pure Nature",null,"Pure Sea",null,"Pure Terra",null,"Kratus","Pure","War","X"]

{"sheet":"Ancient World","index":6,"n_rows":41,"n_cols":35,"rows_kept":41,"merged":[[3,0,3,1],[3,2,3,3],[4,9,4,12],[4,15,4,16]]}
["Ancient World"]
[]
["Breeding"]
["Dragon 1",null,"Dragon 2",null,"Result",null,null,"Ancient Dragons",{"$nulls":6},"Breedable",{"$nulls":3},"Crafting","Summon :","Guardangel",{"$nulls":4},"Habitats",{"$nulls":4},"Gems",null,null,"Shapes"]
["Name","Level","Name","Level",null,"Habitat",null,"Dragon","Level","Elements",{"$nulls":4},"Dragon","Elements",null,null,"Gem","Shape","Required","Done","Clean","Done",null,"Name","Level","Upgrade","Time",null,1,"Red - Ruby",null,"Raw",0]
["Rebird",{"$f":"IF(ISBLANK(A6),\"\",VLOOKUP(A6,AncientDragonTable,2,0))","v":0},"Gorgoneia",{"$f":"IF(ISBLANK(C6),\"\",VLOOKUP(C6,AncientDragonTable,2,0))","v":0},"Mermaid","Magic",null,"Guardangel",null,"Ancient","Beauty","Terra",null,null,"Red Rose","Beauty","Chaos",null,"Red - Ruby","Raw",5,null,{"$f":"IF(ISBLANK(S6),\"\",U6*POWER(5,VLOOKUP(T6,ShapeTable,2,0)-1))","v":1},null,null,"Beauty",1,"560/1300","2h/4h",null,2,"Blue - Sapphire",null,"Clean",1]
["Guardangel",0,"Fulltune",0,"Bride","Beauty",null,"Gorgoneia",null,"Ancient","Magic","Sea",null,null,"Flawless","Beauty","Dream",{"$nulls":5},"",null,null,"Magic",1,"950/2600","2h/4h",null,3,"Yellow - Topaz",null,"5S - Pure",2]
["Guardangel",0,"Obserno",0,"Red Rose","Beauty",null,"Piercing",null,"Ancient","Chaos","Nature",null,null,"Bride","Beauty","Happy",{"$nulls":5},"",null,null,"Chaos",1,"1500/3900","3h/5h",null,4,"Green - Emerald",null,"Drop - Fine",3]
["Piercing",0,"Swin-Jin",0,"Secret Fire","Magic",null,"Rebird",null,"Ancient","Beauty","Flame",null,null,"Mermaid","Beauty","Magic",{"$nulls":5},"",null,null,"Happy",1,"6200/8000","3h/5h",null,5,"Black - Onyx",null,"Tri - Neat",4]
["Guardangel",0,"Ignox",0,"Flawless","Dream",null,"Swin-Jin",null,"Ancient","Magic","Electric",null,null,"Amber","Beauty","Soul",{"$nulls":5},"",null,null,"Dream",1,"8500/10800","4h/6h",null,6,"White - Diamond",null,"Squ - Bright",5]
["Fulltune",0,"Ignox",0,"Balloon","Dream",null,"Obserno",null,"Ancient","Chaos","Metal",null,null,"Prophet","Chaos","Dream",{"$nulls":5},"",null,null,"Soul",1,"11000/14000","4h/6h",{"$nulls":4},"Dbl S - Squared",6]
["Gorgoneia",{"$f":"IF(ISBLANK(A12),\"\",VLOOKUP(A12,AncientDragonTable,2,0))","v":0},"Surfaster",{"$f":"IF(ISBLANK(C12),\"\",VLOOKUP(C12,AncientDragonTable,2,0))","v":0},"Gurgle","Happy",null,"Edeluxe",null,"Ancient","Beauty","Ice",null,null,"Naughty","Chaos","Happy",{"$nulls":16},"6S - Carved",7]
["Piercing",{"$f":"IF(ISBLANK(A13),\"\",VLOOKUP(A13,AncientDragonTable,2,0))","v":0},"Surfaster",{"$f":"IF(ISBLANK(C13),\"\",VLOOKUP(C13,AncientDragonTable,2,0))","v":0},"Naughty","Beauty",null,"Poseadus",null,"Ancient","Magic","Light",null,null,"Underworld","Chaos","Soul",null,"Crafting","Evolve :","Guardangel",{"$nulls":12},"Oval",8]
["Edeluxe",{"$f":"IF(ISBLANK(A14),\"\",VLOOKUP(A14,AncientDragonTable,2,0))","v":0},"Turkgon",{"$f":"IF(ISBLANK(C14),\"\",VLOOKUP(C14,AncientDragonTable,2,0))","v":0},"Amber","Happy",null,"Squidus",null,"Ancient","Chaos","Dark",null,null,"Dreamcatcher","Dream","Soul",null,"Gem","Shape","Required","Done","Clean","Done",{"$nulls":9},"R Tri - Perfect",9]
["Piercing",{"$f":"IF(ISBLANK(A15),\"\",VLOOKUP(A15,AncientDragonTable,2,0))","v":0},"Deliriam",{"$f":"IF(ISBLANK(C15),\"\",VLOOKUP(C15,AncientDragonTable,2,0))","v":0},"Prophet","Chaos",null,"Fulltune",null,"Ancient","Happy","Terra",null,null,"Balloon","Happy","Dream",null,"Red - Ruby","Raw",1,null,{"v":0.2,"d":"0"}]
["Poseadus",{"$f":"IF(ISBLANK(A16),\"\",VLOOKUP(A16,AncientDragonTable,2,0))","v":0},"Cosmoprime",{"$f":"IF(ISBLANK(C16),\"\",VLOOKUP(C16,AncientDragonTable,2,0))","v":0},"Chakra","Soul",null,"Glowppy",null,"Ancient","Happy","Flame",null,null,"The Amazing","Happy","Soul",null,"Red - Ruby","Clean",1,null,1]
["Ankeror",0,"Obserno",0,"Underworld","Chaos",null,"Surfaster",null,"Ancient","Happy","Sea",null,null,"Secret Fire","Magic","Chaos",{"$nulls":5},""]
["Deliriam",0,"Swin-Jin",0,"Illusion","Dream",null,"Deliriam",null,"Ancient","Dream","Nature",null,null,"Illusion","Magic","Dream",{"$nulls":5},""]
["Ankeror",0,"Surfaster",0,"The Amazing","Soul",null,"Ignox",null,"Ancient","Dream","Terra",null,null,"Gurgle","Magic","Happy",{"$nulls":5},""]
["Ankeror",0,"Recondite",0,"Dreamcatcher","Dream",null,"Recondite",null,"Ancient","Dream","Dark",null,null,"Chakra","Magic","Soul",{"$nulls":5},""]
{"$rows_left_out":22}
{"sheet":"Timers","index":7,"n_rows":52,"n_cols":4,"rows_kept":52,"merged":[[13,2,13,3]]}
["Timers"]
[]
["Now","2015-11-21T19:55:49"]
["Wait Days",0]
["Wait Hours",0]
["Wait Minutes",40]
["Wait Seconds",0]
["Wait Time",{"$f":"TIME(B5,B6,B7)","v":"00:40:00"}]
["Expiry Time",{"$f":"B3+B4+B8","v":"2015-11-21T20:35:49"}]
[]
[]
[]
[]
["Time","Description","Remaining"]
[null,"AW - Summon",{"$f":"IF(D15=\"\",\"\",IF(INT(D15)>0,INT(D15),\"\"))","v":""},{"$f":"IF(ISBLANK(A15),\"\",A15-CurTime)","v":""}]
[null,"Breeding - Ancient World",{"$f":"IF(D16=\"\",\"\",IF(INT(D16)>0,INT(D16),\"\"))","v":""},""]
[null,"Breeding - Mountain","",""]
[null,"Breeding - Sanctury","",""]
[null,"Breeding - Tree","",""]
[null,"Calendar","",""]
{"$rows_left_out":32}